hbase-issues mailing list archives

Site index · List index
Message view « Date » · « Thread »
Top « Date » · « Thread »
From "Hudson (JIRA)" <j...@apache.org>
Subject [jira] [Commented] (HBASE-17922) TestRegionServerHostname always fails against hadoop 3.0.0-alpha2
Date Fri, 14 Jul 2017 00:38:01 GMT

    [ https://issues.apache.org/jira/browse/HBASE-17922?page=com.atlassian.jira.plugin.system.issuetabpanels:comment-tabpanel&focusedCommentId=16086652#comment-16086652
] 

Hudson commented on HBASE-17922:
--------------------------------

FAILURE: Integrated in Jenkins build HBase-2.0 #168 (See [https://builds.apache.org/job/HBase-2.0/168/])
HBASE-17922 Clean TestRegionServerHostname for hadoop3. (appy: rev 246d42297bd5e7ef828374c7a80b36a8a2cdbe7c)
* (edit) hbase-server/src/test/java/org/apache/hadoop/hbase/regionserver/TestRegionServerHostname.java


> TestRegionServerHostname always fails against hadoop 3.0.0-alpha2
> -----------------------------------------------------------------
>
>                 Key: HBASE-17922
>                 URL: https://issues.apache.org/jira/browse/HBASE-17922
>             Project: HBase
>          Issue Type: Sub-task
>          Components: hadoop3
>    Affects Versions: 2.0.0
>            Reporter: Jonathan Hsieh
>            Assignee: Mike Drob
>             Fix For: 3.0.0, 2.0.0-alpha-2
>
>         Attachments: HBASE-17922.patch
>
>
> {code}
> Running org.apache.hadoop.hbase.regionserver.TestRegionServerHostname
> Tests run: 2, Failures: 0, Errors: 1, Skipped: 0, Time elapsed: 126.363 sec <<<
FAILURE! - in org.apache.hadoop.hbase.regionserver.TestRegionServerHostname
> testRegionServerHostname(org.apache.hadoop.hbase.regionserver.TestRegionServerHostname)
 Time elapsed: 120.029 sec  <<< ERROR!
> org.junit.runners.model.TestTimedOutException: test timed out after 120000 milliseconds
> 	at java.lang.Thread.sleep(Native Method)
> 	at org.apache.hadoop.hbase.util.JVMClusterUtil.startup(JVMClusterUtil.java:221)
> 	at org.apache.hadoop.hbase.LocalHBaseCluster.startup(LocalHBaseCluster.java:405)
> 	at org.apache.hadoop.hbase.MiniHBaseCluster.init(MiniHBaseCluster.java:225)
> 	at org.apache.hadoop.hbase.MiniHBaseCluster.<init>(MiniHBaseCluster.java:94)
> 	at org.apache.hadoop.hbase.HBaseTestingUtility.startMiniHBaseCluster(HBaseTestingUtility.java:1123)
> 	at org.apache.hadoop.hbase.HBaseTestingUtility.startMiniCluster(HBaseTestingUtility.java:1077)
> 	at org.apache.hadoop.hbase.HBaseTestingUtility.startMiniCluster(HBaseTestingUtility.java:948)
> 	at org.apache.hadoop.hbase.HBaseTestingUtility.startMiniCluster(HBaseTestingUtility.java:942)
> 	at org.apache.hadoop.hbase.regionserver.TestRegionServerHostname.testRegionServerHostname(TestRegionServerHostname.java:88)
> Results :
> Tests in error: 
>   TestRegionServerHostname.testRegionServerHostname:88 ยป TestTimedOut test timed...
> Tests run: 2, Failures: 0, Errors: 1, Skipped: 0
> {code}



--
This message was sent by Atlassian JIRA
(v6.4.14#64029)

Mime
View raw message