hbase-issues mailing list archives

Site index · List index
Message view « Date » · « Thread »
Top « Date » · « Thread »
From "Hadoop QA (JIRA)" <j...@apache.org>
Subject [jira] [Commented] (HBASE-17746) TestSimpleRpcScheduler.testCoDelScheduling is broken
Date Thu, 09 Mar 2017 08:38:38 GMT

    [ https://issues.apache.org/jira/browse/HBASE-17746?page=com.atlassian.jira.plugin.system.issuetabpanels:comment-tabpanel&focusedCommentId=15902677#comment-15902677
] 

Hadoop QA commented on HBASE-17746:
-----------------------------------

| (/) *{color:green}+1 overall{color}* |
\\
\\
|| Vote || Subsystem || Runtime || Comment ||
| {color:blue}0{color} | {color:blue} reexec {color} | {color:blue} 0m 18s {color} | {color:blue}
Docker mode activated. {color} |
| {color:green}+1{color} | {color:green} hbaseanti {color} | {color:green} 0m 0s {color} |
{color:green} Patch does not have any anti-patterns. {color} |
| {color:green}+1{color} | {color:green} @author {color} | {color:green} 0m 0s {color} | {color:green}
The patch does not contain any @author tags. {color} |
| {color:green}+1{color} | {color:green} test4tests {color} | {color:green} 0m 0s {color}
| {color:green} The patch appears to include 1 new or modified test files. {color} |
| {color:green}+1{color} | {color:green} mvninstall {color} | {color:green} 3m 8s {color}
| {color:green} master passed {color} |
| {color:green}+1{color} | {color:green} compile {color} | {color:green} 0m 37s {color} |
{color:green} master passed {color} |
| {color:green}+1{color} | {color:green} checkstyle {color} | {color:green} 0m 47s {color}
| {color:green} master passed {color} |
| {color:green}+1{color} | {color:green} mvneclipse {color} | {color:green} 0m 14s {color}
| {color:green} master passed {color} |
| {color:green}+1{color} | {color:green} findbugs {color} | {color:green} 1m 43s {color} |
{color:green} master passed {color} |
| {color:green}+1{color} | {color:green} javadoc {color} | {color:green} 0m 27s {color} |
{color:green} master passed {color} |
| {color:green}+1{color} | {color:green} mvninstall {color} | {color:green} 0m 42s {color}
| {color:green} the patch passed {color} |
| {color:green}+1{color} | {color:green} compile {color} | {color:green} 0m 38s {color} |
{color:green} the patch passed {color} |
| {color:green}+1{color} | {color:green} javac {color} | {color:green} 0m 38s {color} | {color:green}
the patch passed {color} |
| {color:green}+1{color} | {color:green} checkstyle {color} | {color:green} 0m 48s {color}
| {color:green} the patch passed {color} |
| {color:green}+1{color} | {color:green} mvneclipse {color} | {color:green} 0m 14s {color}
| {color:green} the patch passed {color} |
| {color:green}+1{color} | {color:green} whitespace {color} | {color:green} 0m 0s {color}
| {color:green} The patch has no whitespace issues. {color} |
| {color:green}+1{color} | {color:green} hadoopcheck {color} | {color:green} 27m 51s {color}
| {color:green} Patch does not cause any errors with Hadoop 2.6.1 2.6.2 2.6.3 2.6.4 2.6.5
2.7.1 2.7.2 2.7.3 or 3.0.0-alpha2. {color} |
| {color:green}+1{color} | {color:green} findbugs {color} | {color:green} 1m 56s {color} |
{color:green} the patch passed {color} |
| {color:green}+1{color} | {color:green} javadoc {color} | {color:green} 0m 26s {color} |
{color:green} the patch passed {color} |
| {color:green}+1{color} | {color:green} unit {color} | {color:green} 98m 36s {color} | {color:green}
hbase-server in the patch passed. {color} |
| {color:green}+1{color} | {color:green} asflicense {color} | {color:green} 0m 15s {color}
| {color:green} The patch does not generate ASF License warnings. {color} |
| {color:black}{color} | {color:black} {color} | {color:black} 138m 59s {color} | {color:black}
{color} |
\\
\\
|| Subsystem || Report/Notes ||
| Docker | Client=1.12.3 Server=1.12.3 Image:yetus/hbase:8d52d23 |
| JIRA Patch URL | https://issues.apache.org/jira/secure/attachment/12856942/HBASE-17746.v0.patch
|
| JIRA Issue | HBASE-17746 |
| Optional Tests |  asflicense  javac  javadoc  unit  findbugs  hadoopcheck  hbaseanti  checkstyle
 compile  |
| uname | Linux f64bc8e72d50 3.13.0-106-generic #153-Ubuntu SMP Tue Dec 6 15:44:32 UTC 2016
x86_64 x86_64 x86_64 GNU/Linux |
| Build tool | maven |
| Personality | /home/jenkins/jenkins-slave/workspace/PreCommit-HBASE-Build/component/dev-support/hbase-personality.sh
|
| git revision | master / 1160315 |
| Default Java | 1.8.0_121 |
| findbugs | v3.0.0 |
|  Test Results | https://builds.apache.org/job/PreCommit-HBASE-Build/6027/testReport/ |
| modules | C: hbase-server U: hbase-server |
| Console output | https://builds.apache.org/job/PreCommit-HBASE-Build/6027/console |
| Powered by | Apache Yetus 0.3.0   http://yetus.apache.org |


This message was automatically generated.



> TestSimpleRpcScheduler.testCoDelScheduling is broken
> ----------------------------------------------------
>
>                 Key: HBASE-17746
>                 URL: https://issues.apache.org/jira/browse/HBASE-17746
>             Project: HBase
>          Issue Type: Bug
>          Components: integration tests
>    Affects Versions: 2.0.0
>         Environment: OS: Ubuntu 14.04
> Arch: x86_64
> Linux xxxxxxxxx 3.13.0-24-generic #46-Ubuntu SMP Thu Apr 10 19:11:08 UTC 2014 x86_64
x86_64 x86_64 GNU/Linux
>            Reporter: Anup Halarnkar
>            Assignee: CHIA-PING TSAI
>             Fix For: 2.0.0, 1.4.0
>
>         Attachments: HBASE-17746.v0.patch
>
>
> Command:
> export JAVA_TOOL_OPTIONS="-Xmx8G -Xms2G"
> mvn clean install -X
> Output:
> Results :
> Failed tests:
>   TestSimpleRpcScheduler.testCoDelScheduling:469 None of these calls should have been
discarded expected:<0> but was:<15>
> Tests run: 1191, Failures: 1, Errors: 0, Skipped: 12
> Output of "TestSimpleRpcScheduler.txt" 
> -------------------------------------------------------------------------------
> Test set: org.apache.hadoop.hbase.ipc.TestSimpleRpcScheduler
> -------------------------------------------------------------------------------
> Tests run: 7, Failures: 1, Errors: 0, Skipped: 0, Time elapsed: 7.642 sec <<<
FAILURE! - in org.apache.hadoop.hbase.ipc.TestSimpleRpcScheduler
> testCoDelScheduling(org.apache.hadoop.hbase.ipc.TestSimpleRpcScheduler)  Time elapsed:
0.563 sec  <<< FAILURE!
> java.lang.AssertionError: None of these calls should have been discarded expected:<0>
but was:<15>
>         at org.junit.Assert.fail(Assert.java:88)
>         at org.junit.Assert.failNotEquals(Assert.java:834)
>         at org.junit.Assert.assertEquals(Assert.java:645)
>         at org.apache.hadoop.hbase.ipc.TestSimpleRpcScheduler.testCoDelScheduling(TestSimpleRpcScheduler.java:469)
> ------------------------------------------------------------------------------------------
> Output of last few lines of "TestSimpleRpcScheduler-output.txt"
> 2017-03-07 16:09:16,580 INFO  [main] hbase.ResourceChecker(172): after: ipc.TestSimpleRpcScheduler#testCoDelScheduling
Thread=5 (was 5), OpenFileDescriptor=250 (was 250), MaxFileDescriptor=4096 (was 4096), SystemLoadAverage=607
(was 607), ProcessCount=158 (was 157) - ProcessCount LEAK? -, AvailableMemoryMB=1734 (was
1762)
> 2017-03-07 16:09:16,604 INFO  [main] hbase.ResourceChecker(148): before: ipc.TestSimpleRpcScheduler#testSoftAndHardQueueLimits
Thread=5, OpenFileDescriptor=252, MaxFileDescriptor=4096, SystemLoadAverage=607, ProcessCount=158,
AvailableMemoryMB=1734
> 2017-03-07 16:09:16,722 INFO  [main] ipc.RpcExecutor(145): RpcExecutor  name  using fifo
as call queue; numCallQueues=1; maxQueueLength=5; handlerCount=0
> 2017-03-07 16:09:16,722 DEBUG [main] ipc.RpcExecutor(215): Started RpcServer.deafult.FPBQ.Fifo.handler=0,queue=0,port=0
> 2017-03-07 16:09:16,839 INFO  [main] hbase.ResourceChecker(172): after: ipc.TestSimpleRpcScheduler#testSoftAndHardQueueLimits
Thread=5 (was 5), OpenFileDescriptor=250 (was 252), MaxFileDescriptor=4096 (was 4096), SystemLoadAverage=607
(was 607), ProcessCount=158 (was 158), AvailableMemoryMB=1703 (was 1734)



--
This message was sent by Atlassian JIRA
(v6.3.15#6346)

Mime
View raw message