hbase-issues mailing list archives

Site index · List index
Message view « Date » · « Thread »
Top « Date » · « Thread »
From "Hudson (JIRA)" <j...@apache.org>
Subject [jira] [Commented] (HBASE-16611) Flakey org.apache.hadoop.hbase.client.TestReplicasClient.testCancelOfMultiGet
Date Tue, 13 Sep 2016 12:20:20 GMT

    [ https://issues.apache.org/jira/browse/HBASE-16611?page=com.atlassian.jira.plugin.system.issuetabpanels:comment-tabpanel&focusedCommentId=15487060#comment-15487060
] 

Hudson commented on HBASE-16611:
--------------------------------

FAILURE: Integrated in Jenkins build HBase-Trunk_matrix #1593 (See [https://builds.apache.org/job/HBase-Trunk_matrix/1593/])
HBASE-16611 Flakey (chenheng: rev cd9f42237344756a7db395bd8241f41b00e359a2)
* (edit) hbase-client/src/main/java/org/apache/hadoop/hbase/client/AsyncProcess.java


> Flakey org.apache.hadoop.hbase.client.TestReplicasClient.testCancelOfMultiGet
> -----------------------------------------------------------------------------
>
>                 Key: HBASE-16611
>                 URL: https://issues.apache.org/jira/browse/HBASE-16611
>             Project: HBase
>          Issue Type: Bug
>            Reporter: Heng Chen
>            Assignee: Heng Chen
>             Fix For: 2.0.0
>
>         Attachments: HBASE-16611.patch, HBASE-16611.v1.patch, HBASE-16611.v1.patch, HBASE-16611.v2.patch
>
>
> see 
> https://builds.apache.org/job/PreCommit-HBASE-Build/3494/artifact/patchprocess/patch-unit-hbase-server.txt
> {code}
> testCancelOfMultiGet(org.apache.hadoop.hbase.client.TestReplicasClient)  Time elapsed:
4.026 sec  <<< FAILURE!
> java.lang.AssertionError: null
> 	at org.junit.Assert.fail(Assert.java:86)
> 	at org.junit.Assert.assertTrue(Assert.java:41)
> 	at org.junit.Assert.assertTrue(Assert.java:52)
> 	at org.apache.hadoop.hbase.client.TestReplicasClient.testCancelOfMultiGet(TestReplicasClient.java:579)
> Tests run: 26, Failures: 0, Errors: 0, Skipped: 0, Time elapsed: 94.401 sec - in org.apache.hadoop.hbase.client.TestAdmin2
> Tests run: 1, Failures: 0, Errors: 0, Skipped: 0, Time elapsed: 11.861 sec - in org.apache.hadoop.hbase.client.TestClientScannerRPCTimeout
> Running org.apache.hadoop.hbase.client.TestRestoreSnapshotFromClientWithRegionReplicas
> Tests run: 1, Failures: 1, Errors: 0, Skipped: 0, Time elapsed: 261.925 sec <<<
FAILURE! - in org.apache.hadoop.hbase.client.TestReplicasClient
> testCancelOfMultiGet(org.apache.hadoop.hbase.client.TestReplicasClient)  Time elapsed:
4.522 sec  <<< FAILURE!
> java.lang.AssertionError: null
> 	at org.junit.Assert.fail(Assert.java:86)
> 	at org.junit.Assert.assertTrue(Assert.java:41)
> 	at org.junit.Assert.assertTrue(Assert.java:52)
> 	at org.apache.hadoop.hbase.client.TestReplicasClient.testCancelOfMultiGet(TestReplicasClient.java:581)
> Running org.apache.hadoop.hbase.client.TestFastFail
> Tests run: 2, Failures: 0, Errors: 0, Skipped: 1, Time elapsed: 3.648 sec - in org.apache.hadoop.hbase.client.TestFastFail
> Tests run: 1, Failures: 1, Errors: 0, Skipped: 0, Time elapsed: 277.894 sec <<<
FAILURE! - in org.apache.hadoop.hbase.client.TestReplicasClient
> testCancelOfMultiGet(org.apache.hadoop.hbase.client.TestReplicasClient)  Time elapsed:
5.359 sec  <<< FAILURE!
> java.lang.AssertionError: null
> 	at org.junit.Assert.fail(Assert.java:86)
> 	at org.junit.Assert.assertTrue(Assert.java:41)
> 	at org.junit.Assert.assertTrue(Assert.java:52)
> 	at org.apache.hadoop.hbase.client.TestReplicasClient.testCancelOfMultiGet(TestReplicasClient.java:579)
> {code}



--
This message was sent by Atlassian JIRA
(v6.3.4#6332)

Mime
View raw message