hbase-issues mailing list archives

Site index · List index
Message view « Date » · « Thread »
Top « Date » · « Thread »
From "Hadoop QA (JIRA)" <j...@apache.org>
Subject [jira] [Commented] (HBASE-16611) Flakey org.apache.hadoop.hbase.client.TestReplicasClient.testCancelOfMultiGet
Date Mon, 12 Sep 2016 23:08:20 GMT

    [ https://issues.apache.org/jira/browse/HBASE-16611?page=com.atlassian.jira.plugin.system.issuetabpanels:comment-tabpanel&focusedCommentId=15485577#comment-15485577
] 

Hadoop QA commented on HBASE-16611:
-----------------------------------

| (x) *{color:red}-1 overall{color}* |
\\
\\
|| Vote || Subsystem || Runtime || Comment ||
| {color:blue}0{color} | {color:blue} reexec {color} | {color:blue} 0m 15s {color} | {color:blue}
Docker mode activated. {color} |
| {color:green}+1{color} | {color:green} @author {color} | {color:green} 0m 0s {color} | {color:green}
The patch does not contain any @author tags. {color} |
| {color:red}-1{color} | {color:red} test4tests {color} | {color:red} 0m 0s {color} | {color:red}
The patch doesn't appear to include any new or modified tests. Please justify why no new tests
are needed for this patch. Also please list what manual steps were performed to verify this
patch. {color} |
| {color:blue}0{color} | {color:blue} mvndep {color} | {color:blue} 0m 22s {color} | {color:blue}
Maven dependency ordering for branch {color} |
| {color:green}+1{color} | {color:green} mvninstall {color} | {color:green} 3m 24s {color}
| {color:green} master passed {color} |
| {color:green}+1{color} | {color:green} compile {color} | {color:green} 0m 58s {color} |
{color:green} master passed {color} |
| {color:green}+1{color} | {color:green} checkstyle {color} | {color:green} 0m 47s {color}
| {color:green} master passed {color} |
| {color:green}+1{color} | {color:green} mvneclipse {color} | {color:green} 0m 24s {color}
| {color:green} master passed {color} |
| {color:green}+1{color} | {color:green} findbugs {color} | {color:green} 2m 51s {color} |
{color:green} master passed {color} |
| {color:green}+1{color} | {color:green} javadoc {color} | {color:green} 0m 50s {color} |
{color:green} master passed {color} |
| {color:blue}0{color} | {color:blue} mvndep {color} | {color:blue} 0m 11s {color} | {color:blue}
Maven dependency ordering for patch {color} |
| {color:green}+1{color} | {color:green} mvninstall {color} | {color:green} 1m 10s {color}
| {color:green} the patch passed {color} |
| {color:green}+1{color} | {color:green} compile {color} | {color:green} 0m 57s {color} |
{color:green} the patch passed {color} |
| {color:green}+1{color} | {color:green} javac {color} | {color:green} 0m 57s {color} | {color:green}
the patch passed {color} |
| {color:green}+1{color} | {color:green} checkstyle {color} | {color:green} 0m 44s {color}
| {color:green} the patch passed {color} |
| {color:green}+1{color} | {color:green} mvneclipse {color} | {color:green} 0m 25s {color}
| {color:green} the patch passed {color} |
| {color:green}+1{color} | {color:green} whitespace {color} | {color:green} 0m 0s {color}
| {color:green} The patch has no whitespace issues. {color} |
| {color:green}+1{color} | {color:green} hadoopcheck {color} | {color:green} 28m 4s {color}
| {color:green} Patch does not cause any errors with Hadoop 2.4.0 2.4.1 2.5.0 2.5.1 2.5.2
2.6.1 2.6.2 2.6.3 2.7.1. {color} |
| {color:green}+1{color} | {color:green} hbaseprotoc {color} | {color:green} 0m 22s {color}
| {color:green} the patch passed {color} |
| {color:green}+1{color} | {color:green} findbugs {color} | {color:green} 3m 10s {color} |
{color:green} the patch passed {color} |
| {color:green}+1{color} | {color:green} javadoc {color} | {color:green} 0m 46s {color} |
{color:green} the patch passed {color} |
| {color:green}+1{color} | {color:green} unit {color} | {color:green} 0m 55s {color} | {color:green}
hbase-client in the patch passed. {color} |
| {color:red}-1{color} | {color:red} unit {color} | {color:red} 101m 5s {color} | {color:red}
hbase-server in the patch failed. {color} |
| {color:green}+1{color} | {color:green} asflicense {color} | {color:green} 0m 29s {color}
| {color:green} The patch does not generate ASF License warnings. {color} |
| {color:black}{color} | {color:black} {color} | {color:black} 148m 46s {color} | {color:black}
{color} |
\\
\\
|| Reason || Tests ||
| Timed out junit tests | org.apache.hadoop.hbase.master.TestMasterFailover |
|   | org.apache.hadoop.hbase.master.TestTableLockManager |
|   | org.apache.hadoop.hbase.master.snapshot.TestSnapshotFileCache |
|   | org.apache.hadoop.hbase.replication.TestReplicationTableBase |
\\
\\
|| Subsystem || Report/Notes ||
| Docker | Client=1.11.2 Server=1.11.2 Image:yetus/hbase:7bda515 |
| JIRA Patch URL | https://issues.apache.org/jira/secure/attachment/12828102/HBASE-16611.v1.patch
|
| JIRA Issue | HBASE-16611 |
| Optional Tests |  asflicense  javac  javadoc  unit  findbugs  hadoopcheck  hbaseanti  checkstyle
 compile  |
| uname | Linux 9d3161592681 3.13.0-36-lowlatency #63-Ubuntu SMP PREEMPT Wed Sep 3 21:56:12
UTC 2014 x86_64 x86_64 x86_64 GNU/Linux |
| Build tool | maven |
| Personality | /home/jenkins/jenkins-slave/workspace/PreCommit-HBASE-Build/component/dev-support/hbase-personality.sh
|
| git revision | master / 552400e |
| Default Java | 1.8.0_101 |
| findbugs | v3.0.0 |
| unit | https://builds.apache.org/job/PreCommit-HBASE-Build/3516/artifact/patchprocess/patch-unit-hbase-server.txt
|
| unit test logs |  https://builds.apache.org/job/PreCommit-HBASE-Build/3516/artifact/patchprocess/patch-unit-hbase-server.txt
|
|  Test Results | https://builds.apache.org/job/PreCommit-HBASE-Build/3516/testReport/ |
| modules | C: hbase-client hbase-server U: . |
| Console output | https://builds.apache.org/job/PreCommit-HBASE-Build/3516/console |
| Powered by | Apache Yetus 0.3.0   http://yetus.apache.org |


This message was automatically generated.



> Flakey org.apache.hadoop.hbase.client.TestReplicasClient.testCancelOfMultiGet
> -----------------------------------------------------------------------------
>
>                 Key: HBASE-16611
>                 URL: https://issues.apache.org/jira/browse/HBASE-16611
>             Project: HBase
>          Issue Type: Bug
>            Reporter: Heng Chen
>            Assignee: Heng Chen
>         Attachments: HBASE-16611.patch, HBASE-16611.v1.patch, HBASE-16611.v1.patch
>
>
> see 
> https://builds.apache.org/job/PreCommit-HBASE-Build/3494/artifact/patchprocess/patch-unit-hbase-server.txt
> {code}
> testCancelOfMultiGet(org.apache.hadoop.hbase.client.TestReplicasClient)  Time elapsed:
4.026 sec  <<< FAILURE!
> java.lang.AssertionError: null
> 	at org.junit.Assert.fail(Assert.java:86)
> 	at org.junit.Assert.assertTrue(Assert.java:41)
> 	at org.junit.Assert.assertTrue(Assert.java:52)
> 	at org.apache.hadoop.hbase.client.TestReplicasClient.testCancelOfMultiGet(TestReplicasClient.java:579)
> Tests run: 26, Failures: 0, Errors: 0, Skipped: 0, Time elapsed: 94.401 sec - in org.apache.hadoop.hbase.client.TestAdmin2
> Tests run: 1, Failures: 0, Errors: 0, Skipped: 0, Time elapsed: 11.861 sec - in org.apache.hadoop.hbase.client.TestClientScannerRPCTimeout
> Running org.apache.hadoop.hbase.client.TestRestoreSnapshotFromClientWithRegionReplicas
> Tests run: 1, Failures: 1, Errors: 0, Skipped: 0, Time elapsed: 261.925 sec <<<
FAILURE! - in org.apache.hadoop.hbase.client.TestReplicasClient
> testCancelOfMultiGet(org.apache.hadoop.hbase.client.TestReplicasClient)  Time elapsed:
4.522 sec  <<< FAILURE!
> java.lang.AssertionError: null
> 	at org.junit.Assert.fail(Assert.java:86)
> 	at org.junit.Assert.assertTrue(Assert.java:41)
> 	at org.junit.Assert.assertTrue(Assert.java:52)
> 	at org.apache.hadoop.hbase.client.TestReplicasClient.testCancelOfMultiGet(TestReplicasClient.java:581)
> Running org.apache.hadoop.hbase.client.TestFastFail
> Tests run: 2, Failures: 0, Errors: 0, Skipped: 1, Time elapsed: 3.648 sec - in org.apache.hadoop.hbase.client.TestFastFail
> Tests run: 1, Failures: 1, Errors: 0, Skipped: 0, Time elapsed: 277.894 sec <<<
FAILURE! - in org.apache.hadoop.hbase.client.TestReplicasClient
> testCancelOfMultiGet(org.apache.hadoop.hbase.client.TestReplicasClient)  Time elapsed:
5.359 sec  <<< FAILURE!
> java.lang.AssertionError: null
> 	at org.junit.Assert.fail(Assert.java:86)
> 	at org.junit.Assert.assertTrue(Assert.java:41)
> 	at org.junit.Assert.assertTrue(Assert.java:52)
> 	at org.apache.hadoop.hbase.client.TestReplicasClient.testCancelOfMultiGet(TestReplicasClient.java:579)
> {code}



--
This message was sent by Atlassian JIRA
(v6.3.4#6332)

Mime
View raw message