hbase-issues mailing list archives

Site index · List index
Message view « Date » · « Thread »
Top « Date » · « Thread »
From "Appy (JIRA)" <j...@apache.org>
Subject [jira] [Commented] (HBASE-15215) TestBlockEvictionFromClient is flaky in jdk1.7 build
Date Sun, 25 Sep 2016 06:27:20 GMT

    [ https://issues.apache.org/jira/browse/HBASE-15215?page=com.atlassian.jira.plugin.system.issuetabpanels:comment-tabpanel&focusedCommentId=15520307#comment-15520307
] 

Appy commented on HBASE-15215:
------------------------------

It's failing like crazy now. (https://builds.apache.org/job/HBase-Find-Flaky-Tests/lastSuccessfulBuild/artifact/dashboard.html)
[~stack] [~ram_krish] ptal.

> TestBlockEvictionFromClient is flaky in jdk1.7 build
> ----------------------------------------------------
>
>                 Key: HBASE-15215
>                 URL: https://issues.apache.org/jira/browse/HBASE-15215
>             Project: HBase
>          Issue Type: Sub-task
>            Reporter: ramkrishna.s.vasudevan
>            Assignee: ramkrishna.s.vasudevan
>             Fix For: 2.0.0
>
>         Attachments: HBASE-15215_offheap.patch
>
>
> This is the 2nd time I am noticing this. 
> {code}
> Tests run: 13, Failures: 1, Errors: 0, Skipped: 0, Time elapsed: 76.187 sec <<<
FAILURE! - in org.apache.hadoop.hbase.client.TestBlockEvictionFromClient
> testReverseScanWithCompaction(org.apache.hadoop.hbase.client.TestBlockEvictionFromClient)
 Time elapsed: 5.812 sec  <<< FAILURE!
> java.lang.AssertionError: expected:<3> but was:<2>
> 	at org.junit.Assert.fail(Assert.java:88)
> 	at org.junit.Assert.failNotEquals(Assert.java:834)
> 	at org.junit.Assert.assertEquals(Assert.java:645)
> 	at org.junit.Assert.assertEquals(Assert.java:631)
> 	at org.apache.hadoop.hbase.client.TestBlockEvictionFromClient.testScanWithCompactionInternals(TestBlockEvictionFromClient.java:922)
> 	at org.apache.hadoop.hbase.client.TestBlockEvictionFromClient.testReverseScanWithCompaction(TestBlockEvictionFromClient.java:857)
> {code}
> Generally the jdk1.8 build does not have this failure. Need to investigate the failure.



--
This message was sent by Atlassian JIRA
(v6.3.4#6332)

Mime
View raw message