hbase-issues mailing list archives

Site index · List index
Message view « Date » · « Thread »
Top « Date » · « Thread »
From "Hudson (JIRA)" <j...@apache.org>
Subject [jira] [Commented] (HBASE-16293) TestSnapshotFromMaster#testSnapshotHFileArchiving flakey
Date Fri, 29 Jul 2016 00:38:20 GMT

    [ https://issues.apache.org/jira/browse/HBASE-16293?page=com.atlassian.jira.plugin.system.issuetabpanels:comment-tabpanel&focusedCommentId=15398506#comment-15398506
] 

Hudson commented on HBASE-16293:
--------------------------------

FAILURE: Integrated in HBase-Trunk_matrix #1313 (See [https://builds.apache.org/job/HBase-Trunk_matrix/1313/])
HBASE-16293 TestSnapshotFromMaster#testSnapshotHFileArchiving flakey (matteo.bertozzi: rev
64804a04973d8cbbdd7f1cf6b008cebffc6c3733)
* hbase-server/src/test/java/org/apache/hadoop/hbase/master/cleaner/TestSnapshotFromMaster.java


> TestSnapshotFromMaster#testSnapshotHFileArchiving flakey
> --------------------------------------------------------
>
>                 Key: HBASE-16293
>                 URL: https://issues.apache.org/jira/browse/HBASE-16293
>             Project: HBase
>          Issue Type: Bug
>          Components: test
>    Affects Versions: 2.0.0, 1.4.0
>            Reporter: huaxiang sun
>            Assignee: huaxiang sun
>             Fix For: 2.0.0, 1.4.0
>
>         Attachments: HBASE-16293-v001.patch
>
>
> Got the following stack trace for this failure, not sure if it is related with HBASE-9072
> -------------------------------------------------------
>  T E S T S
> -------------------------------------------------------
> Running org.apache.hadoop.hbase.master.cleaner.TestSnapshotFromMaster
> Tests run: 4, Failures: 0, Errors: 1, Skipped: 0, Time elapsed: 336.042 sec <<<
FAILURE! - in org.apache.hadoop.hbase.master.cleaner.TestSnapshotFromMaster
> testSnapshotHFileArchiving(org.apache.hadoop.hbase.master.cleaner.TestSnapshotFromMaster)
 Time elapsed: 303.771 sec  <<< ERROR!
> org.junit.runners.model.TestTimedOutException: test timed out after 300000 milliseconds
> 	at java.lang.Object.wait(Native Method)
> 	at org.apache.hadoop.hbase.client.AsyncProcess.waitForMaximumCurrentTasks(AsyncProcess.java:1810)
> 	at org.apache.hadoop.hbase.client.AsyncProcess.waitForMaximumCurrentTasks(AsyncProcess.java:1784)
> 	at org.apache.hadoop.hbase.client.AsyncProcess.waitForAllPreviousOpsAndReset(AsyncProcess.java:1860)
> 	at org.apache.hadoop.hbase.client.BufferedMutatorImpl.backgroundFlushCommits(BufferedMutatorImpl.java:241)
> 	at org.apache.hadoop.hbase.client.BufferedMutatorImpl.flush(BufferedMutatorImpl.java:191)
> 	at org.apache.hadoop.hbase.client.HTable.flushCommits(HTable.java:979)
> 	at org.apache.hadoop.hbase.client.HTable.put(HTable.java:576)
> 	at org.apache.hadoop.hbase.HBaseTestingUtility.loadTable(HBaseTestingUtility.java:2002)
> 	at org.apache.hadoop.hbase.HBaseTestingUtility.loadTable(HBaseTestingUtility.java:1979)
> 	at org.apache.hadoop.hbase.HBaseTestingUtility.loadTable(HBaseTestingUtility.java:1967)
> 	at org.apache.hadoop.hbase.HBaseTestingUtility.loadTable(HBaseTestingUtility.java:1945)
> 	at org.apache.hadoop.hbase.master.cleaner.TestSnapshotFromMaster.testSnapshotHFileArchiving(TestSnapshotFromMaster.java:297)
> Results :
> Tests in error: 
>   TestSnapshotFromMaster.testSnapshotHFileArchiving:297->Object.wait:-2 ยป TestTimedOut
> Tests run: 4, Failures: 0, Errors: 1, Skipped: 0



--
This message was sent by Atlassian JIRA
(v6.3.4#6332)

Mime
View raw message