hbase-issues mailing list archives

Site index · List index
Message view « Date » · « Thread »
Top « Date » · « Thread »
From "Hadoop QA (JIRA)" <j...@apache.org>
Subject [jira] [Commented] (HBASE-15932) Shell test fails due to uninitialized constant
Date Wed, 01 Jun 2016 15:11:59 GMT

    [ https://issues.apache.org/jira/browse/HBASE-15932?page=com.atlassian.jira.plugin.system.issuetabpanels:comment-tabpanel&focusedCommentId=15310457#comment-15310457
] 

Hadoop QA commented on HBASE-15932:
-----------------------------------

| (x) *{color:red}-1 overall{color}* |
\\
\\
|| Vote || Subsystem || Runtime || Comment ||
| {color:blue}0{color} | {color:blue} patch {color} | {color:blue} 0m 1s {color} | {color:blue}
The patch file was not named according to hbase's naming conventions. Please see https://yetus.apache.org/documentation/0.2.1/precommit-patchnames
for instructions. {color} |
| {color:blue}0{color} | {color:blue} rubocop {color} | {color:blue} 0m 1s {color} | {color:blue}
rubocop was not available. {color} |
| {color:blue}0{color} | {color:blue} ruby-lint {color} | {color:blue} 0m 1s {color} | {color:blue}
Ruby-lint was not available. {color} |
| {color:green}+1{color} | {color:green} hbaseanti {color} | {color:green} 0m 0s {color} |
{color:green} Patch does not have any anti-patterns. {color} |
| {color:green}+1{color} | {color:green} @author {color} | {color:green} 0m 0s {color} | {color:green}
The patch does not contain any @author tags. {color} |
| {color:red}-1{color} | {color:red} test4tests {color} | {color:red} 0m 0s {color} | {color:red}
The patch doesn't appear to include any new or modified tests. Please justify why no new tests
are needed for this patch. Also please list what manual steps were performed to verify this
patch. {color} |
| {color:blue}0{color} | {color:blue} mvndep {color} | {color:blue} 3m 34s {color} | {color:blue}
Maven dependency ordering for branch {color} |
| {color:green}+1{color} | {color:green} mvninstall {color} | {color:green} 7m 24s {color}
| {color:green} master passed {color} |
| {color:green}+1{color} | {color:green} compile {color} | {color:green} 0m 48s {color} |
{color:green} master passed with JDK v1.8.0 {color} |
| {color:green}+1{color} | {color:green} compile {color} | {color:green} 0m 32s {color} |
{color:green} master passed with JDK v1.7.0_79 {color} |
| {color:green}+1{color} | {color:green} checkstyle {color} | {color:green} 1m 10s {color}
| {color:green} master passed {color} |
| {color:green}+1{color} | {color:green} mvneclipse {color} | {color:green} 0m 58s {color}
| {color:green} master passed {color} |
| {color:green}+1{color} | {color:green} findbugs {color} | {color:green} 1m 2s {color} |
{color:green} master passed {color} |
| {color:green}+1{color} | {color:green} javadoc {color} | {color:green} 0m 56s {color} |
{color:green} master passed with JDK v1.8.0 {color} |
| {color:green}+1{color} | {color:green} javadoc {color} | {color:green} 0m 30s {color} |
{color:green} master passed with JDK v1.7.0_79 {color} |
| {color:blue}0{color} | {color:blue} mvndep {color} | {color:blue} 0m 9s {color} | {color:blue}
Maven dependency ordering for patch {color} |
| {color:green}+1{color} | {color:green} mvninstall {color} | {color:green} 0m 38s {color}
| {color:green} the patch passed {color} |
| {color:green}+1{color} | {color:green} compile {color} | {color:green} 0m 44s {color} |
{color:green} the patch passed with JDK v1.8.0 {color} |
| {color:green}+1{color} | {color:green} javac {color} | {color:green} 0m 44s {color} | {color:green}
the patch passed {color} |
| {color:green}+1{color} | {color:green} compile {color} | {color:green} 0m 31s {color} |
{color:green} the patch passed with JDK v1.7.0_79 {color} |
| {color:green}+1{color} | {color:green} javac {color} | {color:green} 0m 31s {color} | {color:green}
the patch passed {color} |
| {color:green}+1{color} | {color:green} checkstyle {color} | {color:green} 0m 51s {color}
| {color:green} the patch passed {color} |
| {color:green}+1{color} | {color:green} mvneclipse {color} | {color:green} 0m 27s {color}
| {color:green} the patch passed {color} |
| {color:green}+1{color} | {color:green} whitespace {color} | {color:green} 0m 0s {color}
| {color:green} Patch has no whitespace issues. {color} |
| {color:green}+1{color} | {color:green} hadoopcheck {color} | {color:green} 27m 17s {color}
| {color:green} Patch does not cause any errors with Hadoop 2.4.0 2.4.1 2.5.0 2.5.1 2.5.2
2.6.1 2.6.2 2.6.3 2.7.1. {color} |
| {color:green}+1{color} | {color:green} findbugs {color} | {color:green} 1m 16s {color} |
{color:green} the patch passed {color} |
| {color:green}+1{color} | {color:green} javadoc {color} | {color:green} 0m 45s {color} |
{color:green} the patch passed with JDK v1.8.0 {color} |
| {color:green}+1{color} | {color:green} javadoc {color} | {color:green} 0m 28s {color} |
{color:green} the patch passed with JDK v1.7.0_79 {color} |
| {color:green}+1{color} | {color:green} unit {color} | {color:green} 1m 2s {color} | {color:green}
hbase-client in the patch passed. {color} |
| {color:green}+1{color} | {color:green} unit {color} | {color:green} 0m 15s {color} | {color:green}
hbase-shell in the patch passed. {color} |
| {color:green}+1{color} | {color:green} asflicense {color} | {color:green} 0m 18s {color}
| {color:green} Patch does not generate ASF License warnings. {color} |
| {color:black}{color} | {color:black} {color} | {color:black} 52m 14s {color} | {color:black}
{color} |
\\
\\
|| Subsystem || Report/Notes ||
| JIRA Patch URL | https://issues.apache.org/jira/secure/attachment/12807433/15932.v1.txt
|
| JIRA Issue | HBASE-15932 |
| Optional Tests |  asflicense  javac  javadoc  unit  findbugs  hadoopcheck  hbaseanti  checkstyle
 compile  rubocop  ruby_lint  |
| uname | Linux asf905.gq1.ygridcore.net 3.13.0-36-lowlatency #63-Ubuntu SMP PREEMPT Wed Sep
3 21:56:12 UTC 2014 x86_64 x86_64 x86_64 GNU/Linux |
| Build tool | maven |
| Personality | /home/jenkins/jenkins-slave/workspace/PreCommit-HBASE-Build/component/dev-support/hbase-personality.sh
|
| git revision | master / 015f2ef |
| Default Java | 1.7.0_79 |
| Multi-JDK versions |  /home/jenkins/tools/java/jdk1.8.0:1.8.0 /usr/local/jenkins/java/jdk1.7.0_79:1.7.0_79
|
| findbugs | v3.0.0 |
|  Test Results | https://builds.apache.org/job/PreCommit-HBASE-Build/2078/testReport/ |
| modules | C: hbase-client hbase-shell U: . |
| Console output | https://builds.apache.org/job/PreCommit-HBASE-Build/2078/console |
| Powered by | Apache Yetus 0.2.1   http://yetus.apache.org |


This message was automatically generated.



> Shell test fails due to uninitialized constant
> ----------------------------------------------
>
>                 Key: HBASE-15932
>                 URL: https://issues.apache.org/jira/browse/HBASE-15932
>             Project: HBase
>          Issue Type: Bug
>    Affects Versions: 2.0.0
>            Reporter: Ted Yu
>            Assignee: Ted Yu
>             Fix For: 2.0.0
>
>         Attachments: 15932.v1.txt
>
>
> In master branch, shell tests fail due to IN_MEMORY_COMPACTION not being found:
> {code}
> Tests run: 1, Failures: 0, Errors: 1, Skipped: 0, Time elapsed: 32.299 sec <<<
FAILURE! - in org.apache.hadoop.hbase.client.rsgroup.TestShellRSGroups
> testRunShellTests(org.apache.hadoop.hbase.client.rsgroup.TestShellRSGroups)  Time elapsed:
0.069 sec  <<< ERROR!
> org.jruby.embed.EvalFailedException: (NameError) uninitialized constant Java::OrgApacheHadoopHbase::HConstants::IN_MEMORY_COMPACTION
> 	at org.jruby.embed.internal.EmbedEvalUnitImpl.run(EmbedEvalUnitImpl.java:136)
> 	at org.jruby.embed.ScriptingContainer.runUnit(ScriptingContainer.java:1263)
> 	at org.jruby.embed.ScriptingContainer.runScriptlet(ScriptingContainer.java:1308)
> 	at org.apache.hadoop.hbase.client.rsgroup.TestShellRSGroups.testRunShellTests(TestShellRSGroups.java:101)
> Caused by: org.jruby.exceptions.RaiseException: (NameError) uninitialized constant Java::OrgApacheHadoopHbase::HConstants::IN_MEMORY_COMPACTION
> 	at org.jruby.RubyModule.const_missing(org/jruby/RubyModule.java:2647)
> 	at Module.const_missing(file:/home/jenkins/yetus-m2/hbase-master-1/org/jruby/jruby-complete/1.6.8/jruby-complete-1.6.8.jar!/META-INF/jruby.home/lib/ruby/gems/1.8/gems/rake-0.8.7/lib/rake.rb:2503)
> 	at Module.HBaseConstants(/home/jenkins/jenkins-slave/workspace/PreCommit-HBASE-Build/component/hbase-shell/src/main/ruby/hbase.rb:42)
> 	at (Anonymous).(root)(/home/jenkins/jenkins-slave/workspace/PreCommit-HBASE-Build/component/hbase-shell/src/main/ruby/hbase.rb:34)
> 	at org.jruby.RubyKernel.require(org/jruby/RubyKernel.java:1062)
> 	at Kernel.require(/home/jenkins/jenkins-slave/workspace/PreCommit-HBASE-Build/component/hbase-shell/src/main/ruby/hbase.rb:36)
> {code}



--
This message was sent by Atlassian JIRA
(v6.3.4#6332)

Mime
View raw message