hbase-issues mailing list archives

Site index · List index
Message view « Date » · « Thread »
Top « Date » · « Thread »
From "Hadoop QA (JIRA)" <j...@apache.org>
Subject [jira] [Commented] (HBASE-15215) TestBlockEvictionFromClient is flaky in jdk1.7 build
Date Wed, 24 Feb 2016 15:34:18 GMT

    [ https://issues.apache.org/jira/browse/HBASE-15215?page=com.atlassian.jira.plugin.system.issuetabpanels:comment-tabpanel&focusedCommentId=15163196#comment-15163196
] 

Hadoop QA commented on HBASE-15215:
-----------------------------------

| (x) *{color:red}-1 overall{color}* |
\\
\\
|| Vote || Subsystem || Runtime || Comment ||
| {color:blue}0{color} | {color:blue} reexec {color} | {color:blue} 0m 0s {color} | {color:blue}
Docker mode activated. {color} |
| {color:green}+1{color} | {color:green} hbaseanti {color} | {color:green} 0m 0s {color} |
{color:green} Patch does not have any anti-patterns. {color} |
| {color:green}+1{color} | {color:green} @author {color} | {color:green} 0m 0s {color} | {color:green}
The patch does not contain any @author tags. {color} |
| {color:green}+1{color} | {color:green} test4tests {color} | {color:green} 0m 0s {color}
| {color:green} The patch appears to include 1 new or modified test files. {color} |
| {color:green}+1{color} | {color:green} mvninstall {color} | {color:green} 3m 4s {color}
| {color:green} master passed {color} |
| {color:green}+1{color} | {color:green} compile {color} | {color:green} 0m 42s {color} |
{color:green} master passed with JDK v1.8.0_72 {color} |
| {color:green}+1{color} | {color:green} compile {color} | {color:green} 0m 37s {color} |
{color:green} master passed with JDK v1.7.0_95 {color} |
| {color:green}+1{color} | {color:green} checkstyle {color} | {color:green} 4m 8s {color}
| {color:green} master passed {color} |
| {color:green}+1{color} | {color:green} mvneclipse {color} | {color:green} 0m 18s {color}
| {color:green} master passed {color} |
| {color:green}+1{color} | {color:green} findbugs {color} | {color:green} 1m 59s {color} |
{color:green} master passed {color} |
| {color:green}+1{color} | {color:green} javadoc {color} | {color:green} 0m 32s {color} |
{color:green} master passed with JDK v1.8.0_72 {color} |
| {color:green}+1{color} | {color:green} javadoc {color} | {color:green} 0m 37s {color} |
{color:green} master passed with JDK v1.7.0_95 {color} |
| {color:green}+1{color} | {color:green} mvninstall {color} | {color:green} 0m 49s {color}
| {color:green} the patch passed {color} |
| {color:green}+1{color} | {color:green} compile {color} | {color:green} 0m 41s {color} |
{color:green} the patch passed with JDK v1.8.0_72 {color} |
| {color:green}+1{color} | {color:green} javac {color} | {color:green} 0m 41s {color} | {color:green}
the patch passed {color} |
| {color:green}+1{color} | {color:green} compile {color} | {color:green} 0m 37s {color} |
{color:green} the patch passed with JDK v1.7.0_95 {color} |
| {color:green}+1{color} | {color:green} javac {color} | {color:green} 0m 37s {color} | {color:green}
the patch passed {color} |
| {color:green}+1{color} | {color:green} checkstyle {color} | {color:green} 4m 2s {color}
| {color:green} the patch passed {color} |
| {color:green}+1{color} | {color:green} mvneclipse {color} | {color:green} 0m 19s {color}
| {color:green} the patch passed {color} |
| {color:green}+1{color} | {color:green} whitespace {color} | {color:green} 0m 0s {color}
| {color:green} Patch has no whitespace issues. {color} |
| {color:green}+1{color} | {color:green} hadoopcheck {color} | {color:green} 25m 56s {color}
| {color:green} Patch does not cause any errors with Hadoop 2.4.0 2.4.1 2.5.0 2.5.1 2.5.2
2.6.1 2.6.2 2.6.3 2.7.1. {color} |
| {color:green}+1{color} | {color:green} findbugs {color} | {color:green} 2m 4s {color} |
{color:green} the patch passed {color} |
| {color:green}+1{color} | {color:green} javadoc {color} | {color:green} 0m 30s {color} |
{color:green} the patch passed with JDK v1.8.0_72 {color} |
| {color:green}+1{color} | {color:green} javadoc {color} | {color:green} 0m 35s {color} |
{color:green} the patch passed with JDK v1.7.0_95 {color} |
| {color:green}+1{color} | {color:green} unit {color} | {color:green} 103m 1s {color} | {color:green}
hbase-server in the patch passed with JDK v1.8.0_72. {color} |
| {color:red}-1{color} | {color:red} unit {color} | {color:red} 93m 47s {color} | {color:red}
hbase-server in the patch failed with JDK v1.7.0_95. {color} |
| {color:green}+1{color} | {color:green} asflicense {color} | {color:green} 0m 16s {color}
| {color:green} Patch does not generate ASF License warnings. {color} |
| {color:black}{color} | {color:black} {color} | {color:black} 245m 8s {color} | {color:black}
{color} |
\\
\\
|| Reason || Tests ||
| JDK v1.7.0_95 Failed junit tests | hadoop.hbase.replication.multiwal.TestReplicationEndpointWithMultipleWAL
|
\\
\\
|| Subsystem || Report/Notes ||
| Docker | Client=1.9.1 Server=1.9.1 Image:yetus/hbase:date2016-02-24 |
| JIRA Patch URL | https://issues.apache.org/jira/secure/attachment/12789529/HBASE-15215_offheap.patch
|
| JIRA Issue | HBASE-15215 |
| Optional Tests |  asflicense  javac  javadoc  unit  findbugs  hadoopcheck  hbaseanti  checkstyle
 compile  |
| uname | Linux 0515ae1e6a4b 3.13.0-36-lowlatency #63-Ubuntu SMP PREEMPT Wed Sep 3 21:56:12
UTC 2014 x86_64 x86_64 x86_64 GNU/Linux |
| Build tool | maven |
| Personality | /home/jenkins/jenkins-slave/workspace/PreCommit-HBASE-Build/component/dev-support/hbase-personality.sh
|
| git revision | master / 28cd48b |
| findbugs | v3.0.0 |
| unit | https://builds.apache.org/job/PreCommit-HBASE-Build/672/artifact/patchprocess/patch-unit-hbase-server-jdk1.7.0_95.txt
|
| unit test logs |  https://builds.apache.org/job/PreCommit-HBASE-Build/672/artifact/patchprocess/patch-unit-hbase-server-jdk1.7.0_95.txt
|
| JDK v1.7.0_95  Test Results | https://builds.apache.org/job/PreCommit-HBASE-Build/672/testReport/
|
| modules | C: hbase-server U: hbase-server |
| Max memory used | 184MB |
| Powered by | Apache Yetus 0.1.0   http://yetus.apache.org |
| Console output | https://builds.apache.org/job/PreCommit-HBASE-Build/672/console |


This message was automatically generated.



> TestBlockEvictionFromClient is flaky in jdk1.7 build
> ----------------------------------------------------
>
>                 Key: HBASE-15215
>                 URL: https://issues.apache.org/jira/browse/HBASE-15215
>             Project: HBase
>          Issue Type: Sub-task
>            Reporter: ramkrishna.s.vasudevan
>            Assignee: ramkrishna.s.vasudevan
>             Fix For: 2.0.0
>
>         Attachments: HBASE-15215_offheap.patch
>
>
> This is the 2nd time I am noticing this. 
> {code}
> Tests run: 13, Failures: 1, Errors: 0, Skipped: 0, Time elapsed: 76.187 sec <<<
FAILURE! - in org.apache.hadoop.hbase.client.TestBlockEvictionFromClient
> testReverseScanWithCompaction(org.apache.hadoop.hbase.client.TestBlockEvictionFromClient)
 Time elapsed: 5.812 sec  <<< FAILURE!
> java.lang.AssertionError: expected:<3> but was:<2>
> 	at org.junit.Assert.fail(Assert.java:88)
> 	at org.junit.Assert.failNotEquals(Assert.java:834)
> 	at org.junit.Assert.assertEquals(Assert.java:645)
> 	at org.junit.Assert.assertEquals(Assert.java:631)
> 	at org.apache.hadoop.hbase.client.TestBlockEvictionFromClient.testScanWithCompactionInternals(TestBlockEvictionFromClient.java:922)
> 	at org.apache.hadoop.hbase.client.TestBlockEvictionFromClient.testReverseScanWithCompaction(TestBlockEvictionFromClient.java:857)
> {code}
> Generally the jdk1.8 build does not have this failure. Need to investigate the failure.



--
This message was sent by Atlassian JIRA
(v6.3.4#6332)

Mime
View raw message