hbase-issues mailing list archives

Site index · List index
Message view « Date » · « Thread »
Top « Date » · « Thread »
From "Hudson (JIRA)" <j...@apache.org>
Subject [jira] [Commented] (HBASE-14545) TestMasterFailover often times out
Date Sat, 03 Oct 2015 22:46:26 GMT

    [ https://issues.apache.org/jira/browse/HBASE-14545?page=com.atlassian.jira.plugin.system.issuetabpanels:comment-tabpanel&focusedCommentId=14942491#comment-14942491
] 

Hudson commented on HBASE-14545:
--------------------------------

FAILURE: Integrated in HBase-1.2 #224 (See [https://builds.apache.org/job/HBase-1.2/224/])
HBASE-14545 TestMasterFailover often times out (stack: rev 96ed17eaf01496b0a92cb4dbf890acb3d9ad72ac)
* hbase-server/src/main/java/org/apache/hadoop/hbase/LocalHBaseCluster.java
* hbase-server/src/main/java/org/apache/hadoop/hbase/master/RegionStates.java


> TestMasterFailover often times out
> ----------------------------------
>
>                 Key: HBASE-14545
>                 URL: https://issues.apache.org/jira/browse/HBASE-14545
>             Project: HBase
>          Issue Type: Bug
>          Components: test
>    Affects Versions: 1.2.0
>            Reporter: Mikhail Antonov
>            Assignee: stack
>             Fix For: 2.0.0, 1.2.0, 1.3.0, 1.0.3, 1.1.3, 0.98.16
>
>         Attachments: 14545.txt, 14545.txt
>
>
> Tests run: 7, Failures: 0, Errors: 1, Skipped: 0, Time elapsed: 301.644 sec <<<
FAILURE! - in org.apache.hadoop.hbase.master.TestMasterFailover
> testMasterFailoverWithMockedRIT(org.apache.hadoop.hbase.master.TestMasterFailover)  Time
elapsed: 240.112 sec  <<< ERROR!
> org.junit.runners.model.TestTimedOutException: test timed out after 240000 milliseconds
> 	at java.lang.Thread.sleep(Native Method)
> 	at org.apache.hadoop.hbase.util.Threads.sleep(Threads.java:146)
> 	at org.apache.hadoop.hbase.MiniHBaseCluster.waitForActiveAndReadyMaster(MiniHBaseCluster.java:535)
> 	at org.apache.hadoop.hbase.HBaseCluster.waitForActiveAndReadyMaster(HBaseCluster.java:280)
> 	at org.apache.hadoop.hbase.master.TestMasterFailover.testMasterFailoverWithMockedRIT(TestMasterFailover.java:400)
> Results :
> Tests in error:
>   TestMasterFailover.testMasterFailoverWithMockedRIT:400 ยป TestTimedOut test tim...
> Tests run: 7, Failures: 0, Errors: 1, Skipped: 0



--
This message was sent by Atlassian JIRA
(v6.3.4#6332)

Mime
View raw message