hbase-issues mailing list archives

Site index · List index
Message view « Date » · « Thread »
Top « Date » · « Thread »
From "stack (JIRA)" <j...@apache.org>
Subject [jira] [Commented] (HBASE-14545) TestMasterFailover often times out
Date Sat, 03 Oct 2015 20:30:26 GMT

    [ https://issues.apache.org/jira/browse/HBASE-14545?page=com.atlassian.jira.plugin.system.issuetabpanels:comment-tabpanel&focusedCommentId=14942443#comment-14942443
] 

stack commented on HBASE-14545:
-------------------------------

Says this for this test run:

Fetching https://builds.apache.org/job/PreCommit-HBASE-Build/15866//consoleText
Building remotely on H7 (Mapreduce Falcon Hadoop Pig Zookeeper Tez Hdfs) in workspace /home/jenkins/jenkins-slave/workspace/PreCommit-HBASE-Build
Testing patch for HBASE-14545.
Testing patch on branch master.
[INFO] Apache HBase ...................................... SUCCESS [3.098s]
[INFO] Apache HBase - Checkstyle ......................... SUCCESS [0.558s]
[INFO] Apache HBase - Resource Bundle .................... SUCCESS [0.283s]
[INFO] Apache HBase - Annotations ........................ SUCCESS [1.030s]
[INFO] Apache HBase - Protocol ........................... SUCCESS [13.726s]
[INFO] Apache HBase - Common ............................. SUCCESS [1:27.848s]
[INFO] Apache HBase - Procedure .......................... SUCCESS [1:53.827s]
[INFO] Apache HBase - Client ............................. SUCCESS [1:24.302s]
[INFO] Apache HBase - Hadoop Compatibility ............... SUCCESS [7.354s]
[INFO] Apache HBase - Hadoop Two Compatibility ........... SUCCESS [7.926s]
[INFO] Apache HBase - Prefix Tree ........................ SUCCESS [11.199s]
[INFO] Apache HBase - Server ............................. FAILURE [2:14:57.721s]
[INFO] Apache HBase - Testing Util ....................... SKIPPED
[INFO] Apache HBase - Thrift ............................. SKIPPED
[INFO] Apache HBase - Shell .............................. SKIPPED
[INFO] Apache HBase - Integration Tests .................. SKIPPED
[INFO] Apache HBase - Examples ........................... SKIPPED
[INFO] Apache HBase - Rest ............................... SKIPPED
[INFO] Apache HBase - External Block Cache ............... SKIPPED
[INFO] Apache HBase - Assembly ........................... SKIPPED
[INFO] Apache HBase - Shaded ............................. SKIPPED
[INFO] Apache HBase - Shaded - Client .................... SKIPPED
[INFO] Apache HBase - Shaded - Server .................... SKIPPED
[INFO] Apache HBase - Spark .............................. SKIPPED
Printing hanging tests
Hanging test : org.apache.hadoop.hbase.mapreduce.TestHFileOutputFormat2
Printing Failing tests
Failing test : org.apache.hadoop.hbase.client.TestSnapshotCloneIndependence

Let me commit. Will be back to deal with the zombies later.

> TestMasterFailover often times out
> ----------------------------------
>
>                 Key: HBASE-14545
>                 URL: https://issues.apache.org/jira/browse/HBASE-14545
>             Project: HBase
>          Issue Type: Bug
>          Components: test
>    Affects Versions: 1.2.0
>            Reporter: Mikhail Antonov
>             Fix For: 1.2.0
>
>         Attachments: 14545.txt, 14545.txt
>
>
> Tests run: 7, Failures: 0, Errors: 1, Skipped: 0, Time elapsed: 301.644 sec <<<
FAILURE! - in org.apache.hadoop.hbase.master.TestMasterFailover
> testMasterFailoverWithMockedRIT(org.apache.hadoop.hbase.master.TestMasterFailover)  Time
elapsed: 240.112 sec  <<< ERROR!
> org.junit.runners.model.TestTimedOutException: test timed out after 240000 milliseconds
> 	at java.lang.Thread.sleep(Native Method)
> 	at org.apache.hadoop.hbase.util.Threads.sleep(Threads.java:146)
> 	at org.apache.hadoop.hbase.MiniHBaseCluster.waitForActiveAndReadyMaster(MiniHBaseCluster.java:535)
> 	at org.apache.hadoop.hbase.HBaseCluster.waitForActiveAndReadyMaster(HBaseCluster.java:280)
> 	at org.apache.hadoop.hbase.master.TestMasterFailover.testMasterFailoverWithMockedRIT(TestMasterFailover.java:400)
> Results :
> Tests in error:
>   TestMasterFailover.testMasterFailoverWithMockedRIT:400 ยป TestTimedOut test tim...
> Tests run: 7, Failures: 0, Errors: 1, Skipped: 0



--
This message was sent by Atlassian JIRA
(v6.3.4#6332)

Mime
View raw message