hbase-issues mailing list archives

Site index · List index
Message view « Date » · « Thread »
Top « Date » · « Thread »
From "stack (JIRA)" <j...@apache.org>
Subject [jira] [Reopened] (HBASE-14147) REST Support for Namespaces
Date Thu, 10 Sep 2015 04:38:45 GMT

     [ https://issues.apache.org/jira/browse/HBASE-14147?page=com.atlassian.jira.plugin.system.issuetabpanels:all-tabpanel
]

stack reopened HBASE-14147:
---------------------------

Reopening. Reverted from branch-1 and branch-1.2. I left it in master branch. When I build
branch-1, I get this:


[INFO] ------------------------------------------------------------------------
[INFO] BUILD FAILURE
[INFO] ------------------------------------------------------------------------
[INFO] Total time: 56.256s
[INFO] Finished at: Wed Sep 09 21:36:40 PDT 2015
[INFO] Final Memory: 133M/1603M
[INFO] ------------------------------------------------------------------------
[ERROR] Failed to execute goal org.apache.maven.plugins:maven-compiler-plugin:2.5.1:testCompile
(default-testCompile) on project hbase-rest: Compilation failure: Compilation failure:
[ERROR] /Users/stack/checkouts/hbase.git.commit/hbase-rest/src/test/java/org/apache/hadoop/hbase/rest/model/TestNamespacesModel.java:[25,49]
error: cannot find symbol
[ERROR] symbol:   class RestTests
[ERROR] location: package org.apache.hadoop.hbase.testclassification
[ERROR] /Users/stack/checkouts/hbase.git.commit/hbase-rest/src/test/java/org/apache/hadoop/hbase/rest/TestNamespacesInstanceResource.java:[50,49]
error: cannot find symbol
[ERROR] symbol:   class RestTests
[ERROR] location: package org.apache.hadoop.hbase.testclassification
[ERROR] /Users/stack/checkouts/hbase.git.commit/hbase-rest/src/test/java/org/apache/hadoop/hbase/rest/model/TestNamespacesInstanceModel.java:[25,49]
error: cannot find symbol
[ERROR] symbol:   class RestTests
[ERROR] location: package org.apache.hadoop.hbase.testclassification
[ERROR] /Users/stack/checkouts/hbase.git.commit/hbase-rest/src/test/java/org/apache/hadoop/hbase/rest/TestNamespacesResource.java:[37,49]
error: cannot find symbol
[ERROR] symbol:   class RestTests
[ERROR] location: package org.apache.hadoop.hbase.testclassification
[ERROR] /Users/stack/checkouts/hbase.git.commit/hbase-rest/src/test/java/org/apache/hadoop/hbase/rest/model/TestNamespacesModel.java:[31,11]
error: cannot find symbol
[ERROR] symbol: class RestTests
[ERROR] /Users/stack/checkouts/hbase.git.commit/hbase-rest/src/test/java/org/apache/hadoop/hbase/rest/TestNamespacesInstanceResource.java:[61,11]
error: cannot find symbol
[ERROR] symbol: class RestTests
[ERROR] /Users/stack/checkouts/hbase.git.commit/hbase-rest/src/test/java/org/apache/hadoop/hbase/rest/model/TestNamespacesInstanceModel.java:[30,11]
error: cannot find symbol
[ERROR] symbol: class RestTests
[ERROR] /Users/stack/checkouts/hbase.git.commit/hbase-rest/src/test/java/org/apache/hadoop/hbase/rest/TestNamespacesResource.java:[47,11]
error: cannot find symbol
[ERROR] -> [Help 1]


> REST Support for Namespaces
> ---------------------------
>
>                 Key: HBASE-14147
>                 URL: https://issues.apache.org/jira/browse/HBASE-14147
>             Project: HBase
>          Issue Type: Sub-task
>          Components: REST
>    Affects Versions: 1.1.1
>            Reporter: Rick Kellogg
>            Assignee: Matt Warhaftig
>            Priority: Minor
>             Fix For: 2.0.0, 1.2.0, 1.3.0
>
>         Attachments: SuccessfulLocalBuild.txt, hbase-14147-v1.patch, hbase-14147-v1.patch,
hbase-14147-v1.patch
>
>
> Expand REST services to include addition features:
> * Create namespace
> * Alter namespace
> * Describe namespace
> * Drop namespace
> * List tables in a specific namespace
> * List all namespaces.



--
This message was sent by Atlassian JIRA
(v6.3.4#6332)

Mime
View raw message