hbase-issues mailing list archives

Site index · List index
Message view « Date » · « Thread »
Top « Date » · « Thread »
From "Hadoop QA (JIRA)" <j...@apache.org>
Subject [jira] [Commented] (HBASE-13280) TestSecureRPC failed
Date Thu, 19 Mar 2015 12:05:38 GMT

    [ https://issues.apache.org/jira/browse/HBASE-13280?page=com.atlassian.jira.plugin.system.issuetabpanels:comment-tabpanel&focusedCommentId=14368969#comment-14368969
] 

Hadoop QA commented on HBASE-13280:
-----------------------------------

{color:red}-1 overall{color}.  Here are the results of testing the latest attachment 
  http://issues.apache.org/jira/secure/attachment/12705554/HBASE-13280.patch
  against master branch at commit 535ebbfde9e424fab27f79bfa6b40964c4918fc6.
  ATTACHMENT ID: 12705554

    {color:green}+1 @author{color}.  The patch does not contain any @author tags.

    {color:green}+1 tests included{color}.  The patch appears to include 12 new or modified
tests.

    {color:green}+1 hadoop versions{color}. The patch compiles with all supported hadoop versions
(2.4.1 2.5.2 2.6.0)

    {color:green}+1 javac{color}.  The applied patch does not increase the total number of
javac compiler warnings.

    {color:green}+1 javac{color}.  The applied patch does not increase the total number of
javac compiler warnings.

    {color:green}+1 javadoc{color}.  The javadoc tool did not generate any warning messages.

    {color:green}+1 checkstyle{color}.  The applied patch does not increase the total number
of checkstyle errors

    {color:red}-1 findbugs{color}.  The patch appears to introduce 1 new Findbugs (version
2.0.3) warnings.

    {color:green}+1 release audit{color}.  The applied patch does not increase the total number
of release audit warnings.

    {color:green}+1 lineLengths{color}.  The patch does not introduce lines longer than 100

  {color:green}+1 site{color}.  The mvn site goal succeeds with this patch.

    {color:green}+1 core tests{color}.  The patch passed unit tests in .

Test results: https://builds.apache.org/job/PreCommit-HBASE-Build/13314//testReport/
Findbugs warnings: https://builds.apache.org/job/PreCommit-HBASE-Build/13314//artifact/patchprocess/newPatchFindbugsWarningshbase-client.html
Findbugs warnings: https://builds.apache.org/job/PreCommit-HBASE-Build/13314//artifact/patchprocess/newPatchFindbugsWarningshbase-annotations.html
Findbugs warnings: https://builds.apache.org/job/PreCommit-HBASE-Build/13314//artifact/patchprocess/newPatchFindbugsWarningshbase-thrift.html
Findbugs warnings: https://builds.apache.org/job/PreCommit-HBASE-Build/13314//artifact/patchprocess/newPatchFindbugsWarningshbase-server.html
Findbugs warnings: https://builds.apache.org/job/PreCommit-HBASE-Build/13314//artifact/patchprocess/newPatchFindbugsWarningshbase-hadoop2-compat.html
Findbugs warnings: https://builds.apache.org/job/PreCommit-HBASE-Build/13314//artifact/patchprocess/newPatchFindbugsWarningshbase-protocol.html
Findbugs warnings: https://builds.apache.org/job/PreCommit-HBASE-Build/13314//artifact/patchprocess/newPatchFindbugsWarningshbase-examples.html
Findbugs warnings: https://builds.apache.org/job/PreCommit-HBASE-Build/13314//artifact/patchprocess/newPatchFindbugsWarningshbase-hadoop-compat.html
Findbugs warnings: https://builds.apache.org/job/PreCommit-HBASE-Build/13314//artifact/patchprocess/newPatchFindbugsWarningshbase-prefix-tree.html
Findbugs warnings: https://builds.apache.org/job/PreCommit-HBASE-Build/13314//artifact/patchprocess/newPatchFindbugsWarningshbase-common.html
Findbugs warnings: https://builds.apache.org/job/PreCommit-HBASE-Build/13314//artifact/patchprocess/newPatchFindbugsWarningshbase-rest.html
Checkstyle Errors: https://builds.apache.org/job/PreCommit-HBASE-Build/13314//artifact/patchprocess/checkstyle-aggregate.html

  Console output: https://builds.apache.org/job/PreCommit-HBASE-Build/13314//console

This message is automatically generated.

> TestSecureRPC failed
> --------------------
>
>                 Key: HBASE-13280
>                 URL: https://issues.apache.org/jira/browse/HBASE-13280
>             Project: HBase
>          Issue Type: Test
>    Affects Versions: 2.0.0, 1.1.0
>            Reporter: Liu Shaohui
>            Assignee: zhangduo
>            Priority: Minor
>             Fix For: 2.0.0, 1.1.0
>
>         Attachments: HBASE-13280.patch
>
>
> {code}
> Running org.apache.hadoop.hbase.security.TestSecureRPC
> Tests run: 2, Failures: 0, Errors: 2, Skipped: 0, Time elapsed: 33.795 sec <<<
FAILURE! - in org.apache.hadoop.hbase.security.TestSecureRPC
> testRpc(org.apache.hadoop.hbase.security.TestSecureRPC)  Time elapsed: 14.963 sec  <<<
ERROR!
> java.lang.IndexOutOfBoundsException: Index: 0, Size: 0
> 	at java.util.ArrayList.rangeCheck(ArrayList.java:635)
> 	at java.util.ArrayList.get(ArrayList.java:411)
> 	at org.apache.hadoop.hbase.security.TestSecureRPC.testRpcCallWithEnabledKerberosSaslAuth(TestSecureRPC.java:160)
> 	at org.apache.hadoop.hbase.security.TestSecureRPC.testRpc(TestSecureRPC.java:102)
> testAsyncRpc(org.apache.hadoop.hbase.security.TestSecureRPC)  Time elapsed: 5.15 sec
 <<< ERROR!
> java.lang.IndexOutOfBoundsException: Index: 0, Size: 0
> 	at java.util.ArrayList.rangeCheck(ArrayList.java:635)
> 	at java.util.ArrayList.get(ArrayList.java:411)
> 	at org.apache.hadoop.hbase.security.TestSecureRPC.testRpcCallWithEnabledKerberosSaslAuth(TestSecureRPC.java:160)
> 	at org.apache.hadoop.hbase.security.TestSecureRPC.testAsyncRpc(TestSecureRPC.java:107)
> {code}
> From log we saw that:
> {code}
> 2015-03-19 11:27:02,271 WARN  [Thread-5] ipc.RpcClientImpl$Connection$1(662): Couldn't
setup connection for hbase/liushaohui-OptiPlex-990@EXAMPLE.COM to hbase/liushaohui-OptiPlex-990@EXAMPLE.COM
> Exception in thread "Thread-5" java.lang.RuntimeException: com.google.protobuf.ServiceException:
java.io.IOException: Couldn't setup connection for hbase/liushaohui-OptiPlex-990@EXAMPLE.COM
to hbase/liushaohui-OptiPlex-990@EXAMPLE.COM
> 	at org.apache.hadoop.hbase.ipc.TestDelayedRpc$TestThread.run(TestDelayedRpc.java:275)
> Caused by: com.google.protobuf.ServiceException: java.io.IOException: Couldn't setup
connection for hbase/liushaohui-OptiPlex-990@EXAMPLE.COM to hbase/liushaohui-OptiPlex-990@EXAMPLE.COM
> 	at org.apache.hadoop.hbase.ipc.AbstractRpcClient.callBlockingMethod(AbstractRpcClient.java:223)
> 	at org.apache.hadoop.hbase.ipc.AbstractRpcClient$BlockingRpcChannelImplementation.callBlockingMethod(AbstractRpcClient.java:287)
> 	at org.apache.hadoop.hbase.ipc.protobuf.generated.TestDelayedRpcProtos$TestDelayedService$BlockingStub.test(TestDelayedRpcProtos.java:1115)
> 	at org.apache.hadoop.hbase.ipc.TestDelayedRpc$TestThread.run(TestDelayedRpc.java:272)
> Caused by: java.io.IOException: Couldn't setup connection for hbase/liushaohui-OptiPlex-990@EXAMPLE.COM
to hbase/liushaohui-OptiPlex-990@EXAMPLE.COM
> 	at org.apache.hadoop.hbase.ipc.RpcClientImpl$Connection$1.run(RpcClientImpl.java:663)
> 	at java.security.AccessController.doPrivileged(Native Method)
> 	at javax.security.auth.Subject.doAs(Subject.java:415)
> 	at org.apache.hadoop.security.UserGroupInformation.doAs(UserGroupInformation.java:1614)
> 	at org.apache.hadoop.hbase.ipc.RpcClientImpl$Connection.handleSaslConnectionFailure(RpcClientImpl.java:635)
> 	at org.apache.hadoop.hbase.ipc.RpcClientImpl$Connection.setupIOstreams(RpcClientImpl.java:743)
> 	at org.apache.hadoop.hbase.ipc.RpcClientImpl$Connection.writeRequest(RpcClientImpl.java:885)
> 	at org.apache.hadoop.hbase.ipc.RpcClientImpl$Connection.tracedWriteRequest(RpcClientImpl.java:854)
> 	at org.apache.hadoop.hbase.ipc.RpcClientImpl.call(RpcClientImpl.java:1170)
> 	at org.apache.hadoop.hbase.ipc.AbstractRpcClient.callBlockingMethod(AbstractRpcClient.java:213)
> 	... 3 more
> Caused by: javax.security.sasl.SaslException: GSS initiate failed [Caused by GSSException:
No valid credentials provided (Mechanism level: Server not found in Kerberos database (7)
- Server not found in Kerberos database)]
> 	at com.sun.security.sasl.gsskerb.GssKrb5Client.evaluateChallenge(GssKrb5Client.java:212)
> 	at org.apache.hadoop.hbase.security.HBaseSaslRpcClient.saslConnect(HBaseSaslRpcClient.java:179)
> 	at org.apache.hadoop.hbase.ipc.RpcClientImpl$Connection.setupSaslConnection(RpcClientImpl.java:609)
> 	at org.apache.hadoop.hbase.ipc.RpcClientImpl$Connection.access$600(RpcClientImpl.java:154)
> 	at org.apache.hadoop.hbase.ipc.RpcClientImpl$Connection$2.run(RpcClientImpl.java:735)
> 	at org.apache.hadoop.hbase.ipc.RpcClientImpl$Connection$2.run(RpcClientImpl.java:732)
> 	at java.security.AccessController.doPrivileged(Native Method)
> 	at javax.security.auth.Subject.doAs(Subject.java:415)
> 	at org.apache.hadoop.security.UserGroupInformation.doAs(UserGroupInformation.java:1614)
> 	at org.apache.hadoop.hbase.ipc.RpcClientImpl$Connection.setupIOstreams(RpcClientImpl.java:732)
> 	... 7 more
> Caused by: GSSException: No valid credentials provided (Mechanism level: Server not found
in Kerberos database (7) - Server not found in Kerberos database)
> 	at sun.security.jgss.krb5.Krb5Context.initSecContext(Krb5Context.java:710)
> 	at sun.security.jgss.GSSContextImpl.initSecContext(GSSContextImpl.java:248)
> 	at sun.security.jgss.GSSContextImpl.initSecContext(GSSContextImpl.java:179)
> 	at com.sun.security.sasl.gsskerb.GssKrb5Client.evaluateChallenge(GssKrb5Client.java:193)
> 	... 16 more
> Caused by: KrbException: Server not found in Kerberos database (7) - Server not found
in Kerberos database
> 	at sun.security.krb5.KrbTgsRep.<init>(KrbTgsRep.java:73)
> 	at sun.security.krb5.KrbTgsReq.getReply(KrbTgsReq.java:192)
> 	at sun.security.krb5.KrbTgsReq.sendAndGetCreds(KrbTgsReq.java:203)
> 	at sun.security.krb5.internal.CredentialsUtil.serviceCreds(CredentialsUtil.java:311)
> 	at sun.security.krb5.internal.CredentialsUtil.acquireServiceCreds(CredentialsUtil.java:115)
> 	at sun.security.krb5.Credentials.acquireServiceCreds(Credentials.java:449)
> 	at sun.security.jgss.krb5.Krb5Context.initSecContext(Krb5Context.java:641)
> 	... 19 more
> Caused by: KrbException: Identifier doesn't match expected value (906)
> 	at sun.security.krb5.internal.KDCRep.init(KDCRep.java:143)
> 	at sun.security.krb5.internal.TGSRep.init(TGSRep.java:66)
> 	at sun.security.krb5.internal.TGSRep.<init>(TGSRep.java:61)
> 	at sun.security.krb5.KrbTgsRep.<init>(KrbTgsRep.java:55)
> 	... 25 more
> {code}
> Any idea about [~Apache9]? Thanks



--
This message was sent by Atlassian JIRA
(v6.3.4#6332)

Mime
View raw message