hbase-issues mailing list archives

Site index · List index
Message view « Date » · « Thread »
Top « Date » · « Thread »
From "Hadoop QA (JIRA)" <j...@apache.org>
Subject [jira] [Commented] (HBASE-13181) TestHRegionReplayEvents.testReplayBulkLoadEvent fails frequently.
Date Tue, 10 Mar 2015 19:27:39 GMT

    [ https://issues.apache.org/jira/browse/HBASE-13181?page=com.atlassian.jira.plugin.system.issuetabpanels:comment-tabpanel&focusedCommentId=14355535#comment-14355535
] 

Hadoop QA commented on HBASE-13181:
-----------------------------------

{color:red}-1 overall{color}.  Here are the results of testing the latest attachment 
  http://issues.apache.org/jira/secure/attachment/12703687/HBASE-13181-v1.patch
  against master branch at commit 29104da0139cf05357c001e5ef52190ff04ee561.
  ATTACHMENT ID: 12703687

    {color:green}+1 @author{color}.  The patch does not contain any @author tags.

    {color:green}+1 tests included{color}.  The patch appears to include 6 new or modified
tests.

    {color:green}+1 hadoop versions{color}. The patch compiles with all supported hadoop versions
(2.4.1 2.5.2 2.6.0)

    {color:green}+1 javac{color}.  The applied patch does not increase the total number of
javac compiler warnings.

    {color:green}+1 javac{color}.  The applied patch does not increase the total number of
javac compiler warnings.

    {color:green}+1 javadoc{color}.  The javadoc tool did not generate any warning messages.

    {color:green}+1 checkstyle{color}.  The applied patch does not increase the total number
of checkstyle errors

    {color:green}+1 findbugs{color}.  The patch does not introduce any new Findbugs (version
2.0.3) warnings.

    {color:green}+1 release audit{color}.  The applied patch does not increase the total number
of release audit warnings.

    {color:green}+1 lineLengths{color}.  The patch does not introduce lines longer than 100

    {color:red}-1 site{color}.  The patch appears to cause mvn site goal to fail.

    {color:green}+1 core tests{color}.  The patch passed unit tests in .

Test results: https://builds.apache.org/job/PreCommit-HBASE-Build/13155//testReport/
Findbugs warnings: https://builds.apache.org/job/PreCommit-HBASE-Build/13155//artifact/patchprocess/newPatchFindbugsWarningshbase-hadoop-compat.html
Findbugs warnings: https://builds.apache.org/job/PreCommit-HBASE-Build/13155//artifact/patchprocess/newPatchFindbugsWarningshbase-prefix-tree.html
Findbugs warnings: https://builds.apache.org/job/PreCommit-HBASE-Build/13155//artifact/patchprocess/newPatchFindbugsWarningshbase-examples.html
Findbugs warnings: https://builds.apache.org/job/PreCommit-HBASE-Build/13155//artifact/patchprocess/newPatchFindbugsWarningshbase-server.html
Findbugs warnings: https://builds.apache.org/job/PreCommit-HBASE-Build/13155//artifact/patchprocess/newPatchFindbugsWarningshbase-common.html
Findbugs warnings: https://builds.apache.org/job/PreCommit-HBASE-Build/13155//artifact/patchprocess/newPatchFindbugsWarningshbase-rest.html
Findbugs warnings: https://builds.apache.org/job/PreCommit-HBASE-Build/13155//artifact/patchprocess/newPatchFindbugsWarningshbase-protocol.html
Findbugs warnings: https://builds.apache.org/job/PreCommit-HBASE-Build/13155//artifact/patchprocess/newPatchFindbugsWarningshbase-client.html
Findbugs warnings: https://builds.apache.org/job/PreCommit-HBASE-Build/13155//artifact/patchprocess/newPatchFindbugsWarningshbase-thrift.html
Findbugs warnings: https://builds.apache.org/job/PreCommit-HBASE-Build/13155//artifact/patchprocess/newPatchFindbugsWarningshbase-hadoop2-compat.html
Findbugs warnings: https://builds.apache.org/job/PreCommit-HBASE-Build/13155//artifact/patchprocess/newPatchFindbugsWarningshbase-annotations.html
Checkstyle Errors: https://builds.apache.org/job/PreCommit-HBASE-Build/13155//artifact/patchprocess/checkstyle-aggregate.html

  Console output: https://builds.apache.org/job/PreCommit-HBASE-Build/13155//console

This message is automatically generated.

> TestHRegionReplayEvents.testReplayBulkLoadEvent fails frequently.
> -----------------------------------------------------------------
>
>                 Key: HBASE-13181
>                 URL: https://issues.apache.org/jira/browse/HBASE-13181
>             Project: HBase
>          Issue Type: Bug
>            Reporter: Srikanth Srungarapu
>            Assignee: Matteo Bertozzi
>            Priority: Minor
>             Fix For: 2.0.0, 1.1.0
>
>         Attachments: HBASE-13181-v0.patch, HBASE-13181-v1.patch
>
>
> Noticing the test failures frequently on internal test rig:
> {code}
> FAILED:  org.apache.hadoop.hbase.regionserver.TestHRegionReplayEvents.testReplayBulkLoadEvent
> Error Message:
> 3 exceptions [org.apache.hadoop.hbase.io.hfile.CorruptHFileException: Problem reading
HFile Trailer from file /var/lib/jenkins/workspace/CDH5-HBase-1.0.0/hbase-server/target/test-data/a68c6f22-f578-44d2-b17b-6314ea7f6b97/15e393f3-1a5c-45e4-b048-fd647956f1f7,
org.apache.hadoop.hbase.io.hfile.CorruptHFileException: Problem reading HFile Trailer from
file /var/lib/jenkins/workspace/CDH5-HBase-1.0.0/hbase-server/target/test-data/a68c6f22-f578-44d2-b17b-6314ea7f6b97/9bdfbfb1-8a72-4907-9f91-5570d5accfcd,
org.apache.hadoop.hbase.io.hfile.CorruptHFileException: Problem reading HFile Trailer from
file /var/lib/jenkins/workspace/CDH5-HBase-1.0.0/hbase-server/target/test-data/a68c6f22-f578-44d2-b17b-6314ea7f6b97/fe63364b-906a-4085-85b6-605aee4d41c2]
> Stack Trace:
> org.apache.hadoop.io.MultipleIOException: 3 exceptions [org.apache.hadoop.hbase.io.hfile.CorruptHFileException:
Problem reading HFile Trailer from file /var/lib/jenkins/workspace/CDH5-HBase-1.0.0/hbase-server/target/test-data/a68c6f22-f578-44d2-b17b-6314ea7f6b97/15e393f3-1a5c-45e4-b048-fd647956f1f7,
org.apache.hadoop.hbase.io.hfile.CorruptHFileException: Problem reading HFile Trailer from
file /var/lib/jenkins/workspace/CDH5-HBase-1.0.0/hbase-server/target/test-data/a68c6f22-f578-44d2-b17b-6314ea7f6b97/9bdfbfb1-8a72-4907-9f91-5570d5accfcd,
org.apache.hadoop.hbase.io.hfile.CorruptHFileException: Problem reading HFile Trailer from
file /var/lib/jenkins/workspace/CDH5-HBase-1.0.0/hbase-server/target/test-data/a68c6f22-f578-44d2-b17b-6314ea7f6b97/fe63364b-906a-4085-85b6-605aee4d41c2]
>         at org.apache.hadoop.io.MultipleIOException.createIOException(MultipleIOException.java:52)
>         at org.apache.hadoop.hbase.regionserver.HRegion.bulkLoadHFiles(HRegion.java:4910)
>         at org.apache.hadoop.hbase.regionserver.HRegion.bulkLoadHFiles(HRegion.java:4855)
>         at org.apache.hadoop.hbase.regionserver.TestHRegionReplayEvents.testReplayBulkLoadEvent(TestHRegionReplayEvents.java:1159)
> {code}



--
This message was sent by Atlassian JIRA
(v6.3.4#6332)

Mime
View raw message