hbase-issues mailing list archives

Site index · List index
Message view « Date » · « Thread »
Top « Date » · « Thread »
From "Hadoop QA (JIRA)" <j...@apache.org>
Subject [jira] [Commented] (HBASE-13176) Flakey TestZooKeeper test.
Date Fri, 13 Mar 2015 16:40:38 GMT

    [ https://issues.apache.org/jira/browse/HBASE-13176?page=com.atlassian.jira.plugin.system.issuetabpanels:comment-tabpanel&focusedCommentId=14360606#comment-14360606
] 

Hadoop QA commented on HBASE-13176:
-----------------------------------

{color:green}+1 overall{color}.  Here are the results of testing the latest attachment 
  http://issues.apache.org/jira/secure/attachment/12704438/HBASE-13176.patch
  against master branch at commit fbe7322870fa06406895ea2b4e5b2aae52209e6d.
  ATTACHMENT ID: 12704438

    {color:green}+1 @author{color}.  The patch does not contain any @author tags.

    {color:green}+1 tests included{color}.  The patch appears to include 3 new or modified
tests.

    {color:green}+1 hadoop versions{color}. The patch compiles with all supported hadoop versions
(2.4.1 2.5.2 2.6.0)

    {color:green}+1 javac{color}.  The applied patch does not increase the total number of
javac compiler warnings.

    {color:green}+1 javac{color}.  The applied patch does not increase the total number of
javac compiler warnings.

    {color:green}+1 javadoc{color}.  The javadoc tool did not generate any warning messages.

    {color:green}+1 checkstyle{color}.  The applied patch does not increase the total number
of checkstyle errors

    {color:green}+1 findbugs{color}.  The patch does not introduce any new Findbugs (version
2.0.3) warnings.

    {color:green}+1 release audit{color}.  The applied patch does not increase the total number
of release audit warnings.

    {color:green}+1 lineLengths{color}.  The patch does not introduce lines longer than 100

  {color:green}+1 site{color}.  The mvn site goal succeeds with this patch.

    {color:green}+1 core tests{color}.  The patch passed unit tests in .

Test results: https://builds.apache.org/job/PreCommit-HBASE-Build/13229//testReport/
Findbugs warnings: https://builds.apache.org/job/PreCommit-HBASE-Build/13229//artifact/patchprocess/newPatchFindbugsWarningshbase-protocol.html
Findbugs warnings: https://builds.apache.org/job/PreCommit-HBASE-Build/13229//artifact/patchprocess/newPatchFindbugsWarningshbase-hadoop-compat.html
Findbugs warnings: https://builds.apache.org/job/PreCommit-HBASE-Build/13229//artifact/patchprocess/newPatchFindbugsWarningshbase-thrift.html
Findbugs warnings: https://builds.apache.org/job/PreCommit-HBASE-Build/13229//artifact/patchprocess/newPatchFindbugsWarningshbase-server.html
Findbugs warnings: https://builds.apache.org/job/PreCommit-HBASE-Build/13229//artifact/patchprocess/newPatchFindbugsWarningshbase-common.html
Findbugs warnings: https://builds.apache.org/job/PreCommit-HBASE-Build/13229//artifact/patchprocess/newPatchFindbugsWarningshbase-hadoop2-compat.html
Findbugs warnings: https://builds.apache.org/job/PreCommit-HBASE-Build/13229//artifact/patchprocess/newPatchFindbugsWarningshbase-rest.html
Findbugs warnings: https://builds.apache.org/job/PreCommit-HBASE-Build/13229//artifact/patchprocess/newPatchFindbugsWarningshbase-examples.html
Findbugs warnings: https://builds.apache.org/job/PreCommit-HBASE-Build/13229//artifact/patchprocess/newPatchFindbugsWarningshbase-client.html
Findbugs warnings: https://builds.apache.org/job/PreCommit-HBASE-Build/13229//artifact/patchprocess/newPatchFindbugsWarningshbase-prefix-tree.html
Findbugs warnings: https://builds.apache.org/job/PreCommit-HBASE-Build/13229//artifact/patchprocess/newPatchFindbugsWarningshbase-annotations.html
Checkstyle Errors: https://builds.apache.org/job/PreCommit-HBASE-Build/13229//artifact/patchprocess/checkstyle-aggregate.html

  Console output: https://builds.apache.org/job/PreCommit-HBASE-Build/13229//console

This message is automatically generated.

> Flakey TestZooKeeper test.
> --------------------------
>
>                 Key: HBASE-13176
>                 URL: https://issues.apache.org/jira/browse/HBASE-13176
>             Project: HBase
>          Issue Type: Bug
>    Affects Versions: 2.0.0
>            Reporter: Andrey Stepachev
>            Assignee: Andrey Stepachev
>         Attachments: HBASE-13176.patch
>
>
> Test fails with wrong number of listeners:
> {code}
> Tests run: 11, Failures: 1, Errors: 0, Skipped: 0, Time elapsed: 202.248 sec <<<
FAILURE! - in org.apache.hadoop.hbase.TestZooKeeper
> testRegionAssignmentAfterMasterRecoveryDueToZKExpiry(org.apache.hadoop.hbase.TestZooKeeper)
Time elapsed: 48.687 sec <<< FAILURE!
> java.lang.AssertionError: expected:<16> but was:<15>
> at org.junit.Assert.fail(Assert.java:88)
> at org.junit.Assert.failNotEquals(Assert.java:743)
> at org.junit.Assert.assertEquals(Assert.java:118)
> at org.junit.Assert.assertEquals(Assert.java:555)
> at org.junit.Assert.assertEquals(Assert.java:542)
> at org.apache.hadoop.hbase.TestZooKeeper.testRegionAssignmentAfterMasterRecoveryDueToZKExpiry(TestZooKeeper.java:518)
> {code}



--
This message was sent by Atlassian JIRA
(v6.3.4#6332)

Mime
View raw message