hbase-issues mailing list archives

Site index · List index
Message view « Date » · « Thread »
Top « Date » · « Thread »
From "Hudson (JIRA)" <j...@apache.org>
Subject [jira] [Commented] (HBASE-13176) Flakey TestZooKeeper test.
Date Tue, 17 Mar 2015 16:45:39 GMT

    [ https://issues.apache.org/jira/browse/HBASE-13176?page=com.atlassian.jira.plugin.system.issuetabpanels:comment-tabpanel&focusedCommentId=14365471#comment-14365471
] 

Hudson commented on HBASE-13176:
--------------------------------

SUCCESS: Integrated in HBase-TRUNK #6272 (See [https://builds.apache.org/job/HBase-TRUNK/6272/])
HBASE-13176 Flakey TestZooKeeper test. (octo47: rev ed026c2e6f518963ee7fb9c7b26266e888c71c2d)
* hbase-server/src/test/java/org/apache/hadoop/hbase/TestZooKeeper.java


> Flakey TestZooKeeper test.
> --------------------------
>
>                 Key: HBASE-13176
>                 URL: https://issues.apache.org/jira/browse/HBASE-13176
>             Project: HBase
>          Issue Type: Bug
>    Affects Versions: 2.0.0
>            Reporter: Andrey Stepachev
>            Assignee: Andrey Stepachev
>             Fix For: 2.0.0, 1.0.1, 1.1.1
>
>         Attachments: HBASE-13176.patch
>
>
> Test fails with wrong number of listeners:
> {code}
> Tests run: 11, Failures: 1, Errors: 0, Skipped: 0, Time elapsed: 202.248 sec <<<
FAILURE! - in org.apache.hadoop.hbase.TestZooKeeper
> testRegionAssignmentAfterMasterRecoveryDueToZKExpiry(org.apache.hadoop.hbase.TestZooKeeper)
Time elapsed: 48.687 sec <<< FAILURE!
> java.lang.AssertionError: expected:<16> but was:<15>
> at org.junit.Assert.fail(Assert.java:88)
> at org.junit.Assert.failNotEquals(Assert.java:743)
> at org.junit.Assert.assertEquals(Assert.java:118)
> at org.junit.Assert.assertEquals(Assert.java:555)
> at org.junit.Assert.assertEquals(Assert.java:542)
> at org.apache.hadoop.hbase.TestZooKeeper.testRegionAssignmentAfterMasterRecoveryDueToZKExpiry(TestZooKeeper.java:518)
> {code}



--
This message was sent by Atlassian JIRA
(v6.3.4#6332)

Mime
View raw message