hbase-issues mailing list archives

Site index · List index
Message view « Date » · « Thread »
Top « Date » · « Thread »
From "Andrey Stepachev (JIRA)" <j...@apache.org>
Subject [jira] [Updated] (HBASE-13176) Flakey TestZooKeeper test.
Date Tue, 17 Mar 2015 15:13:38 GMT

     [ https://issues.apache.org/jira/browse/HBASE-13176?page=com.atlassian.jira.plugin.system.issuetabpanels:all-tabpanel
]

Andrey Stepachev updated HBASE-13176:
-------------------------------------
       Resolution: Fixed
    Fix Version/s: 1.1.1
                   1.0.1
                   2.0.0
           Status: Resolved  (was: Patch Available)

> Flakey TestZooKeeper test.
> --------------------------
>
>                 Key: HBASE-13176
>                 URL: https://issues.apache.org/jira/browse/HBASE-13176
>             Project: HBase
>          Issue Type: Bug
>    Affects Versions: 2.0.0
>            Reporter: Andrey Stepachev
>            Assignee: Andrey Stepachev
>             Fix For: 2.0.0, 1.0.1, 1.1.1
>
>         Attachments: HBASE-13176.patch
>
>
> Test fails with wrong number of listeners:
> {code}
> Tests run: 11, Failures: 1, Errors: 0, Skipped: 0, Time elapsed: 202.248 sec <<<
FAILURE! - in org.apache.hadoop.hbase.TestZooKeeper
> testRegionAssignmentAfterMasterRecoveryDueToZKExpiry(org.apache.hadoop.hbase.TestZooKeeper)
Time elapsed: 48.687 sec <<< FAILURE!
> java.lang.AssertionError: expected:<16> but was:<15>
> at org.junit.Assert.fail(Assert.java:88)
> at org.junit.Assert.failNotEquals(Assert.java:743)
> at org.junit.Assert.assertEquals(Assert.java:118)
> at org.junit.Assert.assertEquals(Assert.java:555)
> at org.junit.Assert.assertEquals(Assert.java:542)
> at org.apache.hadoop.hbase.TestZooKeeper.testRegionAssignmentAfterMasterRecoveryDueToZKExpiry(TestZooKeeper.java:518)
> {code}



--
This message was sent by Atlassian JIRA
(v6.3.4#6332)

Mime
View raw message