hbase-issues mailing list archives

Site index · List index
Message view « Date » · « Thread »
Top « Date » · « Thread »
From "Qiang Tian (JIRA)" <j...@apache.org>
Subject [jira] [Updated] (HBASE-12357) TestHCM#testClusterStatus is continuosly failing in jenkins
Date Tue, 28 Oct 2014 08:30:34 GMT

     [ https://issues.apache.org/jira/browse/HBASE-12357?page=com.atlassian.jira.plugin.system.issuetabpanels:all-tabpanel
]

Qiang Tian updated HBASE-12357:
-------------------------------
    Description: 
{}


{noformat}Tests run: 21, Failures: 0, Errors: 1, Skipped: 2, Time elapsed: 187.475 sec <<<
FAILURE! - in org.apache.hadoop.hbase.client.TestHCM
testClusterStatus(org.apache.hadoop.hbase.client.TestHCM)  Time elapsed: 41.477 sec  <<<
ERROR!
java.lang.Exception: Unexpected exception, expected<org.apache.hadoop.hbase.regionserver.RegionServerStoppedException>
but was<junit.framework.AssertionFailedError>
	at junit.framework.Assert.fail(Assert.java:57)
	at org.apache.hadoop.hbase.Waiter.waitFor(Waiter.java:193)
	at org.apache.hadoop.hbase.HBaseTestingUtility.waitFor(HBaseTestingUtility.java:3537)
	at org.apache.hadoop.hbase.client.TestHCM.testClusterStatus(TestHCM.java:273)
{noformat}

  was:
{noformat}Tests run: 21, Failures: 0, Errors: 1, Skipped: 2, Time elapsed: 187.475 sec <<<
FAILURE! - in org.apache.hadoop.hbase.client.TestHCM
testClusterStatus(org.apache.hadoop.hbase.client.TestHCM)  Time elapsed: 41.477 sec  <<<
ERROR!
java.lang.Exception: Unexpected exception, expected<org.apache.hadoop.hbase.regionserver.RegionServerStoppedException>
but was<junit.framework.AssertionFailedError>
	at junit.framework.Assert.fail(Assert.java:57)
	at org.apache.hadoop.hbase.Waiter.waitFor(Waiter.java:193)
	at org.apache.hadoop.hbase.HBaseTestingUtility.waitFor(HBaseTestingUtility.java:3537)
	at org.apache.hadoop.hbase.client.TestHCM.testClusterStatus(TestHCM.java:273)
{noformat}


> TestHCM#testClusterStatus is continuosly failing in jenkins
> -----------------------------------------------------------
>
>                 Key: HBASE-12357
>                 URL: https://issues.apache.org/jira/browse/HBASE-12357
>             Project: HBase
>          Issue Type: Bug
>          Components: test
>    Affects Versions: 1.0.0
>            Reporter: Ashish Singhi
>            Assignee: Dima Spivak
>
> {}
> {noformat}Tests run: 21, Failures: 0, Errors: 1, Skipped: 2, Time elapsed: 187.475 sec
<<< FAILURE! - in org.apache.hadoop.hbase.client.TestHCM
> testClusterStatus(org.apache.hadoop.hbase.client.TestHCM)  Time elapsed: 41.477 sec 
<<< ERROR!
> java.lang.Exception: Unexpected exception, expected<org.apache.hadoop.hbase.regionserver.RegionServerStoppedException>
but was<junit.framework.AssertionFailedError>
> 	at junit.framework.Assert.fail(Assert.java:57)
> 	at org.apache.hadoop.hbase.Waiter.waitFor(Waiter.java:193)
> 	at org.apache.hadoop.hbase.HBaseTestingUtility.waitFor(HBaseTestingUtility.java:3537)
> 	at org.apache.hadoop.hbase.client.TestHCM.testClusterStatus(TestHCM.java:273)
> {noformat}



--
This message was sent by Atlassian JIRA
(v6.3.4#6332)

Mime
View raw message