hbase-issues mailing list archives

Site index · List index
Message view « Date » · « Thread »
Top « Date » · « Thread »
From "Hudson (JIRA)" <j...@apache.org>
Subject [jira] [Commented] (HBASE-12246) Compilation with hadoop-2.3.x and 2.2.x is broken
Date Tue, 14 Oct 2014 02:15:34 GMT

    [ https://issues.apache.org/jira/browse/HBASE-12246?page=com.atlassian.jira.plugin.system.issuetabpanels:comment-tabpanel&focusedCommentId=14170382#comment-14170382
] 

Hudson commented on HBASE-12246:
--------------------------------

SUCCESS: Integrated in HBase-1.0 #307 (See [https://builds.apache.org/job/HBase-1.0/307/])
HBASE-12246 Compilation with hadoop-2.3.x and 2.2.x is broken -> HBASE-12220 Add hedgedReads
and hedgedReadWins metrics -- REVERT (stack: rev 8828e0a68089f62322e8f5d49eba16e806daa75e)
* hbase-server/src/test/java/org/apache/hadoop/hbase/util/TestFSUtils.java
* hbase-hadoop2-compat/src/main/java/org/apache/hadoop/hbase/regionserver/MetricsRegionServerSourceImpl.java
* hbase-server/src/test/java/org/apache/hadoop/hbase/regionserver/MetricsRegionServerWrapperStub.java
* hbase-hadoop-compat/src/main/java/org/apache/hadoop/hbase/regionserver/MetricsRegionServerSource.java
* hbase-hadoop-compat/src/main/java/org/apache/hadoop/hbase/regionserver/MetricsRegionServerWrapper.java
* hbase-server/src/main/java/org/apache/hadoop/hbase/util/FSUtils.java
* hbase-server/src/main/java/org/apache/hadoop/hbase/master/SplitLogManager.java
* hbase-server/src/main/java/org/apache/hadoop/hbase/regionserver/MetricsRegionServerWrapperImpl.java


> Compilation with hadoop-2.3.x and 2.2.x is broken
> -------------------------------------------------
>
>                 Key: HBASE-12246
>                 URL: https://issues.apache.org/jira/browse/HBASE-12246
>             Project: HBase
>          Issue Type: Bug
>            Reporter: Enis Soztutar
>            Assignee: stack
>            Priority: Blocker
>             Fix For: 2.0.0, 0.99.2
>
>
> This seems due to hedged read metrics
> {code}
> [INFO] ------------------------------------------------------------------------
> [INFO] BUILD FAILURE
> [INFO] ------------------------------------------------------------------------
> [INFO] Total time: 25.648s
> [INFO] Finished at: Mon Oct 13 14:03:35 PDT 2014
> [INFO] Final Memory: 70M/495M
> [INFO] ------------------------------------------------------------------------
> [ERROR] Failed to execute goal org.apache.maven.plugins:maven-compiler-plugin:2.5.1:compile
(default-compile) on project hbase-server: Compilation failure: Compilation failure:
> [ERROR] /Users/enis/projects/rc-test/hbase-0.99.1/hbase-server/src/main/java/org/apache/hadoop/hbase/util/FSUtils.java:[74,29]
error: cannot find symbol
> [ERROR] symbol:   class DFSHedgedReadMetrics
> [ERROR] location: package org.apache.hadoop.hdfs
> [ERROR] /Users/enis/projects/rc-test/hbase-0.99.1/hbase-server/src/main/java/org/apache/hadoop/hbase/util/FSUtils.java:[1881,16]
error: cannot find symbol
> [ERROR] symbol:   class DFSHedgedReadMetrics
> [ERROR] location: class FSUtils
> {code}



--
This message was sent by Atlassian JIRA
(v6.3.4#6332)

Mime
View raw message