hbase-issues mailing list archives

Site index · List index
Message view « Date » · « Thread »
Top « Date » · « Thread »
From "Ted Yu (JIRA)" <j...@apache.org>
Subject [jira] [Commented] (HBASE-12195) Fix dev-support/findHangingTests
Date Tue, 07 Oct 2014 21:39:35 GMT

    [ https://issues.apache.org/jira/browse/HBASE-12195?page=com.atlassian.jira.plugin.system.issuetabpanels:comment-tabpanel&focusedCommentId=14162583#comment-14162583
] 

Ted Yu commented on HBASE-12195:
--------------------------------

I tried this command:
python dev-support/findHangingTests.py https://builds.apache.org/job/HBase-TRUNK/5622/consoleFull
{code}
Hanging test : org.apache.hadoop.hbase.replication.regionserver.TestRegionReplicaReplicationEndpoint
{code}
The console output has some more details:
{code}
Tests run: 7, Failures: 0, Errors: 5, Skipped: 0, Time elapsed: 317.124 sec <<< FAILURE!
- in org.apache.hadoop.hbase.replication.regionserver.TestRegionReplicaReplicationEndpoint
testRegionReplicaReplicationIgnoresDisabledTables(org.apache.hadoop.hbase.replication.regionserver.TestRegionReplicaReplicationEndpoint)
 Time elapsed: 60.061 sec  <<< ERROR!
java.lang.Exception: test timed out after 60000 milliseconds
	at java.lang.Long.parseLong(Long.java:483)
	at org.apache.hadoop.conf.Configuration.getLong(Configuration.java:1147)
	at org.apache.hadoop.hbase.regionserver.StoreScanner.<init>(StoreScanner.java:130)
	at org.apache.hadoop.hbase.regionserver.StoreScanner.<init>(StoreScanner.java:167)
	at org.apache.hadoop.hbase.regionserver.HStore.getScanner(HStore.java:1890)
	at org.apache.hadoop.hbase.regionserver.HRegion$RegionScannerImpl.<init>(HRegion.java:4032)
	at org.apache.hadoop.hbase.regionserver.HRegion.instantiateRegionScanner(HRegion.java:2109)
	at org.apache.hadoop.hbase.regionserver.HRegion.getScanner(HRegion.java:2095)
	at org.apache.hadoop.hbase.regionserver.HRegion.getScanner(HRegion.java:2072)
	at org.apache.hadoop.hbase.regionserver.HRegion.get(HRegion.java:5014)
	at org.apache.hadoop.hbase.regionserver.HRegion.get(HRegion.java:4988)
	at org.apache.hadoop.hbase.HBaseTestingUtility.verifyNumericRows(HBaseTestingUtility.java:1933)
	at org.apache.hadoop.hbase.replication.regionserver.TestRegionReplicaReplicationEndpoint$1.evaluate(TestRegionReplicaReplicationEndpoint.java:199)
	at org.apache.hadoop.hbase.Waiter.waitFor(Waiter.java:177)
	at org.apache.hadoop.hbase.Waiter.waitFor(Waiter.java:128)
	at org.apache.hadoop.hbase.replication.regionserver.TestRegionReplicaReplicationEndpoint.verifyReplication(TestRegionReplicaReplicationEndpoint.java:194)
	at org.apache.hadoop.hbase.replication.regionserver.TestRegionReplicaReplicationEndpoint.testRegionReplicaReplicationIgnoresDisabledTables(TestRegionReplicaReplicationEndpoint.java:337)
	at org.apache.hadoop.hbase.replication.regionserver.TestRegionReplicaReplicationEndpoint.testRegionReplicaReplicationIgnoresDisabledTables(TestRegionReplicaReplicationEndpoint.java:264)

testRegionReplicaReplicationWith3Replicas(org.apache.hadoop.hbase.replication.regionserver.TestRegionReplicaReplicationEndpoint)
 Time elapsed: 60.045 sec  <<< ERROR!
java.lang.Exception: test timed out after 60000 milliseconds
	at java.lang.Thread.sleep(Native Method)
	at org.apache.hadoop.hbase.Waiter.waitFor(Waiter.java:181)
	at org.apache.hadoop.hbase.Waiter.waitFor(Waiter.java:128)
	at org.apache.hadoop.hbase.replication.regionserver.TestRegionReplicaReplicationEndpoint.verifyReplication(TestRegionReplicaReplicationEndpoint.java:194)
	at org.apache.hadoop.hbase.replication.regionserver.TestRegionReplicaReplicationEndpoint.testRegionReplicaReplication(TestRegionReplicaReplicationEndpoint.java:164)
	at org.apache.hadoop.hbase.replication.regionserver.TestRegionReplicaReplicationEndpoint.testRegionReplicaReplicationWith3Replicas(TestRegionReplicaReplicationEndpoint.java:219)
{code}
Is it possible to include part of the failure report ?

> Fix dev-support/findHangingTests
> --------------------------------
>
>                 Key: HBASE-12195
>                 URL: https://issues.apache.org/jira/browse/HBASE-12195
>             Project: HBase
>          Issue Type: Improvement
>          Components: test
>    Affects Versions: 1.0.0
>            Reporter: Manukranth Kolloju
>            Assignee: Manukranth Kolloju
>            Priority: Minor
>             Fix For: 1.0.0
>
>         Attachments: 0001-Fix-findHangingTests.patch
>
>   Original Estimate: 24h
>  Remaining Estimate: 24h
>
> The existing script findHangingTests.sh fails to actually find hanging tests. Fixing
it by replacing it with findHangingTests.py. 



--
This message was sent by Atlassian JIRA
(v6.3.4#6332)

Mime
View raw message