hbase-issues mailing list archives

Site index · List index
Message view « Date » · « Thread »
Top « Date » · « Thread »
From "Mikhail Antonov (JIRA)" <j...@apache.org>
Subject [jira] [Commented] (HBASE-11673) TestIOFencing#testFencingAroundCompactionAfterWALSync fails
Date Wed, 13 Aug 2014 01:30:13 GMT

    [ https://issues.apache.org/jira/browse/HBASE-11673?page=com.atlassian.jira.plugin.system.issuetabpanels:comment-tabpanel&focusedCommentId=14095008#comment-14095008
] 

Mikhail Antonov commented on HBASE-11673:
-----------------------------------------

[~tedyu], [~tianq], [~sergey.soldatov]  - I've looked thru last 4 builds of hbase-trunk started
by hadoop-qa, in all of them this test has passed successfully (in several of them, though,
TestRegionRebalancing has failed, but that's another story). So unless someone has a sequence
of steps to reliably reproduce the failure, I'd say we can resolve this jira (and re-open
later, if we have more details about the failure). 
What do you think? [~tianq] does this test pass for you now?

> TestIOFencing#testFencingAroundCompactionAfterWALSync fails
> -----------------------------------------------------------
>
>                 Key: HBASE-11673
>                 URL: https://issues.apache.org/jira/browse/HBASE-11673
>             Project: HBase
>          Issue Type: Test
>            Reporter: Qiang Tian
>            Assignee: Sergey Soldatov
>             Fix For: 2.0.0
>
>         Attachments: HBASE_11673-v1.patch, testFencingAroundCompactionAfterWALSync.tar.gz
>
>
> got several test failure on the latest build:
> {quote}    
> [tianq@bdvm101 surefire-reports]$ ls -1t|grep "Tests run" * |grep "<<< FAILURE"

> org.apache.hadoop.hbase.client.TestReplicasClient.txt:Tests run: 1, Failures: 0, Errors:
1, Skipped: 0, Time elapsed: 38.706 sec <<< FAILURE!
> org.apache.hadoop.hbase.master.TestMasterOperationsForRegionReplicas.txt:Tests run: 2,
Failures: 1, Errors: 0, Skipped: 0, Time elapsed: 30.669 sec <<< FAILURE!
> org.apache.hadoop.hbase.regionserver.TestRegionReplicas.txt:Tests run: 1, Failures: 0,
Errors: 1, Skipped: 0, Time elapsed: 39.113 sec <<< FAILURE!
> org.apache.hadoop.hbase.TestIOFencing.txt:Tests run: 2, Failures: 1, Errors: 0, Skipped:
0, Time elapsed: 177.071 sec <<< FAILURE!
> {quote} 
> the first one:
> {quote} 
> <failure message="Timed out waiting for the region to flush" type="java.lang.AssertionError">java.lang.AssertionError:
Timed out waiting for the region to flush
> >-at org.junit.Assert.fail(Assert.java:88)
> >-at org.junit.Assert.assertTrue(Assert.java:41)
> >-at org.apache.hadoop.hbase.TestIOFencing.doTest(TestIOFencing.java:291)
> >-at org.apache.hadoop.hbase.TestIOFencing.testFencingAroundCompactionAfterWALSync(TestIOFencing.java:236)
> >-at sun.reflect.NativeMethodAccessorImpl.invoke0(Native Method)
> >-at sun.reflect.NativeMethodAccessorImpl.invoke(NativeMethodAccessorImpl.java:57)
> >-at sun.reflect.DelegatingMethodAccessorImpl.invoke(DelegatingMethodAccessorImpl.java:43)
> >-at java.lang.reflect.Method.invoke(Method.java:606)
> {quote}



--
This message was sent by Atlassian JIRA
(v6.2#6252)

Mime
View raw message