hbase-issues mailing list archives

Site index · List index
Message view « Date » · « Thread »
Top « Date » · « Thread »
From "Ted Yu (JIRA)" <j...@apache.org>
Subject [jira] [Updated] (HBASE-10387) Add config option to LoadTestTool which allows skipping call to System.exit()
Date Mon, 20 Jan 2014 21:53:21 GMT

     [ https://issues.apache.org/jira/browse/HBASE-10387?page=com.atlassian.jira.plugin.system.issuetabpanels:all-tabpanel
]

Ted Yu updated HBASE-10387:
---------------------------

    Assignee: Ted Yu
      Status: Patch Available  (was: Open)

> Add config option to LoadTestTool which allows skipping call to System.exit()
> -----------------------------------------------------------------------------
>
>                 Key: HBASE-10387
>                 URL: https://issues.apache.org/jira/browse/HBASE-10387
>             Project: HBase
>          Issue Type: Improvement
>            Reporter: Ted Yu
>            Assignee: Ted Yu
>         Attachments: 10387-v1.txt
>
>
> I was running Hoya load test which uses LoadTestTool.
> The load was successful. However Hoya test failed with:
> {code}
> [ERROR] Command was/bin/sh -c cd /home/yarn/hoya/hoya-funtest && /usr/lib/jvm/java-1.7.0-openjdk-1.7.0.9.x86_64/jre/bin/java
-Xmx1024m -XX:+HeapDumpOnOutOfMemoryError -jar /home/yarn/hoya/hoya-funtest/target/surefire/surefirebooter274017860635722411.jar
/home/yarn/hoya/hoya-funtest/target/surefire/surefire6543037778494048137tmp /home/yarn/hoya/hoya-funtest/target/surefire/surefire_07364766695548839031tmp
> [ERROR] -> [Help 1]
> org.apache.maven.lifecycle.LifecycleExecutionException: Failed to execute goal org.apache.maven.plugins:maven-surefire-plugin:2.16:test
(default-test) on project hoya-funtest: Execution default-test of goal org.apache.maven.plugins:maven-surefire-plugin:2.16:test
failed: The forked VM terminated without saying properly goodbye. VM crash or System.exit
called ?
> Command was/bin/sh -c cd /home/yarn/hoya/hoya-funtest && /usr/lib/jvm/java-1.7.0-openjdk-1.7.0.9.x86_64/jre/bin/java
-Xmx1024m -XX:+HeapDumpOnOutOfMemoryError -jar /home/yarn/hoya/hoya-funtest/target/surefire/surefirebooter274017860635722411.jar
/home/yarn/hoya/hoya-funtest/target/surefire/surefire6543037778494048137tmp /home/yarn/hoya/hoya-funtest/target/surefire/surefire_07364766695548839031tmp
> 	at org.apache.maven.lifecycle.internal.MojoExecutor.execute(MojoExecutor.java:224)
> 	at org.apache.maven.lifecycle.internal.MojoExecutor.execute(MojoExecutor.java:153)
> 	at org.apache.maven.lifecycle.internal.MojoExecutor.execute(MojoExecutor.java:145)
> 	at org.apache.maven.lifecycle.internal.LifecycleModuleBuilder.buildProject(LifecycleModuleBuilder.java:84)
> 	at org.apache.maven.lifecycle.internal.LifecycleModuleBuilder.buildProject(LifecycleModuleBuilder.java:59)
> 	at org.apache.maven.lifecycle.internal.LifecycleStarter.singleThreadedBuild(LifecycleStarter.java:183)
> 	at org.apache.maven.lifecycle.internal.LifecycleStarter.execute(LifecycleStarter.java:161)
> 	at org.apache.maven.DefaultMaven.doExecute(DefaultMaven.java:317)
>         at org.apache.maven.lifecycle.internal.MojoExecutor.execute(MojoExecutor.java:145)
>         at org.apache.maven.lifecycle.internal.LifecycleModuleBuilder.buildProject(LifecycleModuleBuilder.java:84)
>         at org.apache.maven.lifecycle.internal.LifecycleModuleBuilder.buildProject(LifecycleModuleBuilder.java:59)
>         at org.apache.maven.lifecycle.internal.LifecycleStarter.singleThreadedBuild(LifecycleStarter.java:183)
>         at org.apache.maven.lifecycle.internal.LifecycleStarter.execute(LifecycleStarter.java:161)
>         at org.apache.maven.DefaultMaven.doExecute(DefaultMaven.java:317)
>         at org.apache.maven.DefaultMaven.execute(DefaultMaven.java:152)
>         at org.apache.maven.cli.MavenCli.execute(MavenCli.java:555)
>         at org.apache.maven.cli.MavenCli.doMain(MavenCli.java:214)
>         at org.apache.maven.cli.MavenCli.main(MavenCli.java:158)
>         at sun.reflect.NativeMethodAccessorImpl.invoke0(Native Method)
>         at sun.reflect.NativeMethodAccessorImpl.invoke(NativeMethodAccessorImpl.java:57)
>         at sun.reflect.DelegatingMethodAccessorImpl.invoke(DelegatingMethodAccessorImpl.java:43)
>         at java.lang.reflect.Method.invoke(Method.java:601)
>         at org.codehaus.plexus.classworlds.launcher.Launcher.launchEnhanced(Launcher.java:289)
>         at org.codehaus.plexus.classworlds.launcher.Launcher.launch(Launcher.java:229)
>         at org.codehaus.plexus.classworlds.launcher.Launcher.mainWithExitCode(Launcher.java:415)
>         at org.codehaus.plexus.classworlds.launcher.Launcher.main(Launcher.java:356)
> Caused by: org.apache.maven.plugin.PluginExecutionException: Execution default-test of
goal org.apache.maven.plugins:maven-surefire-plugin:2.16:test failed: The forked VM terminated
without saying properly goodbye. VM crash or System.exit called ?
> Command was/bin/sh -c cd /home/yarn/hoya/hoya-funtest && /usr/lib/jvm/java-1.7.0-openjdk-1.7.0.9.x86_64/jre/bin/java
-Xmx1024m -XX:+HeapDumpOnOutOfMemoryError -jar /home/yarn/hoya/hoya-funtest/target/surefire/surefirebooter274017860635722411.jar
/home/yarn/hoya/hoya-funtest/target/surefire/surefire6543037778494048137tmp /home/yarn/hoya/hoya-funtest/target/surefire/surefire_07364766695548839031tmp
>         at org.apache.maven.plugin.DefaultBuildPluginManager.executeMojo(DefaultBuildPluginManager.java:115)
>         at org.apache.maven.lifecycle.internal.MojoExecutor.execute(MojoExecutor.java:208)
>         ... 19 more
> Caused by: java.lang.RuntimeException: The forked VM terminated without saying properly
goodbye. VM crash or System.exit called ?
> Command was/bin/sh -c cd /home/yarn/hoya/hoya-funtest && /usr/lib/jvm/java-1.7.0-openjdk-1.7.0.9.x86_64/jre/bin/java
-Xmx1024m -XX:+HeapDumpOnOutOfMemoryError -jar /home/yarn/hoya/hoya-funtest/target/surefire/surefirebooter274017860635722411.jar
/home/yarn/hoya/hoya-funtest/target/surefire/surefire6543037778494048137tmp /home/yarn/hoya/hoya-funtest/target/surefire/surefire_07364766695548839031tmp
>         at org.apache.maven.plugin.surefire.booterclient.ForkStarter.fork(ForkStarter.java:485)
>         at org.apache.maven.plugin.surefire.booterclient.ForkStarter.fork(ForkStarter.java:352)
>         at org.apache.maven.plugin.surefire.booterclient.ForkStarter.run(ForkStarter.java:158)
>         at org.apache.maven.plugin.surefire.AbstractSurefireMojo.executeProvider(AbstractSurefireMojo.java:958)
>         at org.apache.maven.plugin.surefire.AbstractSurefireMojo.executeAfterPreconditionsChecked(AbstractSurefireMojo.java:822)
>         at org.apache.maven.plugin.surefire.AbstractSurefireMojo.execute(AbstractSurefireMojo.java:720)
>         at org.apache.maven.plugin.DefaultBuildPluginManager.executeMojo(DefaultBuildPluginManager.java:106)
>         ... 20 more
> {code}
> This was due to the following call in doStaticMain():
> {code}
>     System.exit(ret);
> {code}
> A config option can be added so that the above call is skipped in the case where LoadTestTool
is activated from maven and load test succeeds.



--
This message was sent by Atlassian JIRA
(v6.1.5#6160)

Mime
View raw message