hbase-issues mailing list archives

Site index · List index
Message view « Date » · « Thread »
Top « Date » · « Thread »
From "Hadoop QA (JIRA)" <j...@apache.org>
Subject [jira] [Commented] (HBASE-10238) TestAccessController#verifyDenied can fail even if ADE is thrown
Date Wed, 25 Dec 2013 10:26:50 GMT

    [ https://issues.apache.org/jira/browse/HBASE-10238?page=com.atlassian.jira.plugin.system.issuetabpanels:comment-tabpanel&focusedCommentId=13856563#comment-13856563
] 

Hadoop QA commented on HBASE-10238:
-----------------------------------

{color:red}-1 overall{color}.  Here are the results of testing the latest attachment 
  http://issues.apache.org/jira/secure/attachment/12620404/10238.patch
  against trunk revision .
  ATTACHMENT ID: 12620404

    {color:green}+1 @author{color}.  The patch does not contain any @author tags.

    {color:green}+1 tests included{color}.  The patch appears to include 3 new or modified
tests.

    {color:green}+1 hadoop1.0{color}.  The patch compiles against the hadoop 1.0 profile.

    {color:green}+1 hadoop1.1{color}.  The patch compiles against the hadoop 1.1 profile.

    {color:green}+1 javadoc{color}.  The javadoc tool did not generate any warning messages.

    {color:green}+1 javac{color}.  The applied patch does not increase the total number of
javac compiler warnings.

    {color:green}+1 findbugs{color}.  The patch does not introduce any new Findbugs (version
1.3.9) warnings.

    {color:green}+1 release audit{color}.  The applied patch does not increase the total number
of release audit warnings.

    {color:green}+1 lineLengths{color}.  The patch does not introduce lines longer than 100

    {color:red}-1 site{color}.  The patch appears to cause mvn site goal to fail.

    {color:green}+1 core tests{color}.  The patch passed unit tests in .

Test results: https://builds.apache.org/job/PreCommit-HBASE-Build/8283//testReport/
Findbugs warnings: https://builds.apache.org/job/PreCommit-HBASE-Build/8283//artifact/trunk/patchprocess/newPatchFindbugsWarningshbase-protocol.html
Findbugs warnings: https://builds.apache.org/job/PreCommit-HBASE-Build/8283//artifact/trunk/patchprocess/newPatchFindbugsWarningshbase-thrift.html
Findbugs warnings: https://builds.apache.org/job/PreCommit-HBASE-Build/8283//artifact/trunk/patchprocess/newPatchFindbugsWarningshbase-client.html
Findbugs warnings: https://builds.apache.org/job/PreCommit-HBASE-Build/8283//artifact/trunk/patchprocess/newPatchFindbugsWarningshbase-hadoop2-compat.html
Findbugs warnings: https://builds.apache.org/job/PreCommit-HBASE-Build/8283//artifact/trunk/patchprocess/newPatchFindbugsWarningshbase-examples.html
Findbugs warnings: https://builds.apache.org/job/PreCommit-HBASE-Build/8283//artifact/trunk/patchprocess/newPatchFindbugsWarningshbase-prefix-tree.html
Findbugs warnings: https://builds.apache.org/job/PreCommit-HBASE-Build/8283//artifact/trunk/patchprocess/newPatchFindbugsWarningshbase-common.html
Findbugs warnings: https://builds.apache.org/job/PreCommit-HBASE-Build/8283//artifact/trunk/patchprocess/newPatchFindbugsWarningshbase-server.html
Findbugs warnings: https://builds.apache.org/job/PreCommit-HBASE-Build/8283//artifact/trunk/patchprocess/newPatchFindbugsWarningshbase-hadoop-compat.html
Console output: https://builds.apache.org/job/PreCommit-HBASE-Build/8283//console

This message is automatically generated.

> TestAccessController#verifyDenied can fail even if ADE is thrown
> ----------------------------------------------------------------
>
>                 Key: HBASE-10238
>                 URL: https://issues.apache.org/jira/browse/HBASE-10238
>             Project: HBase
>          Issue Type: Bug
>    Affects Versions: 0.98.0, 0.99.0
>            Reporter: Andrew Purtell
>            Assignee: Andrew Purtell
>             Fix For: 0.98.0, 0.99.0
>
>         Attachments: 10238.patch
>
>
> In TestAccessController#verifyDenied there is code attempting to deal with UTEs with
AccessDeniedException as a nested cause. Although it would seem the code intends to handle
the exception reported by a recently failed test on the 0.98 Hadoop 1.1 Jenkins build here:
> {noformat}
> java.lang.reflect.UndeclaredThrowableException: Unknown exception in doAs
> Caused by: java.security.PrivilegedActionException: com.google.protobuf.ServiceException:
Error calling method PingService.noop
> Caused by: com.google.protobuf.ServiceException: Error calling method PingService.noop
> Caused by: org.apache.hadoop.hbase.security.AccessDeniedExceptionorg.apache.hadoop.hbase.security.AccessDeniedException:
Insufficient permissions (user=UserB, scope=testCoprocessorExec, family=, action=EXEC)
> Caused by: org.apache.hadoop.hbase.ipc.RemoteWithExtrasException: org.apache.hadoop.hbase.security.AccessDeniedException:
Insufficient permissions (user=UserB, scope=testCoprocessorExec, family=, action=EXEC)
> ...
> {noformat}
> it didn't work properly.



--
This message was sent by Atlassian JIRA
(v6.1.5#6160)

Mime
View raw message