hbase-issues mailing list archives

Site index · List index
Message view « Date » · « Thread »
Top « Date » · « Thread »
From "Ted Yu (JIRA)" <j...@apache.org>
Subject [jira] [Updated] (HBASE-10005) TestVisibilityLabels fails occasionally
Date Tue, 19 Nov 2013 20:37:21 GMT

     [ https://issues.apache.org/jira/browse/HBASE-10005?page=com.atlassian.jira.plugin.system.issuetabpanels:all-tabpanel
]

Ted Yu updated HBASE-10005:
---------------------------

    Description: 
I got the following test failures running test suite on hadoop-2 where distributed log replay
was turned on :
{code}
testAddVisibilityLabelsOnRSRestart(org.apache.hadoop.hbase.security.visibility.TestVisibilityLabels)
 Time elapsed: 0.019 sec  <<< FAILURE!
java.lang.AssertionError: The count should be 8 expected:<8> but was:<6>
  at org.junit.Assert.fail(Assert.java:88)
  at org.junit.Assert.failNotEquals(Assert.java:743)
  at org.junit.Assert.assertEquals(Assert.java:118)
  at org.junit.Assert.assertEquals(Assert.java:555)
  at org.apache.hadoop.hbase.security.visibility.TestVisibilityLabels.testAddVisibilityLabelsOnRSRestart(TestVisibilityLabels.java:408)
...
testClearUserAuths(org.apache.hadoop.hbase.security.visibility.TestVisibilityLabels)  Time
elapsed: 0.002 sec  <<< FAILURE!
java.lang.AssertionError
  at org.junit.Assert.fail(Assert.java:86)
  at org.junit.Assert.assertTrue(Assert.java:41)
  at org.junit.Assert.assertTrue(Assert.java:52)
  at org.apache.hadoop.hbase.security.visibility.TestVisibilityLabels.testClearUserAuths(TestVisibilityLabels.java:505)
{code}
Logs to be attached

  was:
I got the following test failures running test suite on hadoop-2 :
{code}
testAddVisibilityLabelsOnRSRestart(org.apache.hadoop.hbase.security.visibility.TestVisibilityLabels)
 Time elapsed: 0.019 sec  <<< FAILURE!
java.lang.AssertionError: The count should be 8 expected:<8> but was:<6>
  at org.junit.Assert.fail(Assert.java:88)
  at org.junit.Assert.failNotEquals(Assert.java:743)
  at org.junit.Assert.assertEquals(Assert.java:118)
  at org.junit.Assert.assertEquals(Assert.java:555)
  at org.apache.hadoop.hbase.security.visibility.TestVisibilityLabels.testAddVisibilityLabelsOnRSRestart(TestVisibilityLabels.java:408)
...
testClearUserAuths(org.apache.hadoop.hbase.security.visibility.TestVisibilityLabels)  Time
elapsed: 0.002 sec  <<< FAILURE!
java.lang.AssertionError
  at org.junit.Assert.fail(Assert.java:86)
  at org.junit.Assert.assertTrue(Assert.java:41)
  at org.junit.Assert.assertTrue(Assert.java:52)
  at org.apache.hadoop.hbase.security.visibility.TestVisibilityLabels.testClearUserAuths(TestVisibilityLabels.java:505)
{code}
Logs to be attached


> TestVisibilityLabels fails occasionally
> ---------------------------------------
>
>                 Key: HBASE-10005
>                 URL: https://issues.apache.org/jira/browse/HBASE-10005
>             Project: HBase
>          Issue Type: Bug
>            Reporter: Ted Yu
>         Attachments: org.apache.hadoop.hbase.security.visibility.TestVisibilityLabels-output.txt
>
>
> I got the following test failures running test suite on hadoop-2 where distributed log
replay was turned on :
> {code}
> testAddVisibilityLabelsOnRSRestart(org.apache.hadoop.hbase.security.visibility.TestVisibilityLabels)
 Time elapsed: 0.019 sec  <<< FAILURE!
> java.lang.AssertionError: The count should be 8 expected:<8> but was:<6>
>   at org.junit.Assert.fail(Assert.java:88)
>   at org.junit.Assert.failNotEquals(Assert.java:743)
>   at org.junit.Assert.assertEquals(Assert.java:118)
>   at org.junit.Assert.assertEquals(Assert.java:555)
>   at org.apache.hadoop.hbase.security.visibility.TestVisibilityLabels.testAddVisibilityLabelsOnRSRestart(TestVisibilityLabels.java:408)
> ...
> testClearUserAuths(org.apache.hadoop.hbase.security.visibility.TestVisibilityLabels)
 Time elapsed: 0.002 sec  <<< FAILURE!
> java.lang.AssertionError
>   at org.junit.Assert.fail(Assert.java:86)
>   at org.junit.Assert.assertTrue(Assert.java:41)
>   at org.junit.Assert.assertTrue(Assert.java:52)
>   at org.apache.hadoop.hbase.security.visibility.TestVisibilityLabels.testClearUserAuths(TestVisibilityLabels.java:505)
> {code}
> Logs to be attached



--
This message was sent by Atlassian JIRA
(v6.1#6144)

Mime
View raw message