hbase-issues mailing list archives

Site index · List index
Message view « Date » · « Thread »
Top « Date » · « Thread »
From "Hudson (JIRA)" <j...@apache.org>
Subject [jira] [Commented] (HBASE-9600) TestColumnSchemaModel and TestTableSchemaModel test cases are failing with IBM IBM Java 6
Date Sat, 21 Sep 2013 03:34:52 GMT

    [ https://issues.apache.org/jira/browse/HBASE-9600?page=com.atlassian.jira.plugin.system.issuetabpanels:comment-tabpanel&focusedCommentId=13773706#comment-13773706
] 

Hudson commented on HBASE-9600:
-------------------------------

FAILURE: Integrated in HBase-TRUNK #4543 (See [https://builds.apache.org/job/HBase-TRUNK/4543/])
HBASE-9600 TestColumnSchemaModel and TestTableSchemaModel test cases are failing with IBM
IBM Java 6 (stack: rev 1525179)
* /hbase/trunk/hbase-server/src/main/java/org/apache/hadoop/hbase/rest/model/ColumnSchemaModel.java
* /hbase/trunk/hbase-server/src/main/java/org/apache/hadoop/hbase/rest/model/TableSchemaModel.java
* /hbase/trunk/hbase-server/src/test/java/org/apache/hadoop/hbase/rest/model/TestColumnSchemaModel.java

                
> TestColumnSchemaModel and TestTableSchemaModel test cases are failing with IBM IBM Java
6
> -----------------------------------------------------------------------------------------
>
>                 Key: HBASE-9600
>                 URL: https://issues.apache.org/jira/browse/HBASE-9600
>             Project: HBase
>          Issue Type: Bug
>    Affects Versions: 0.96.0
>         Environment: RHEL 6.3, IBM Java 6 SR14
>            Reporter: Paulo Ricardo Paz Vital
>             Fix For: 0.98.0, 0.96.0
>
>         Attachments: HABSE-9600.patch
>
>
> After the commit of HBASE-9435, the TestColumnSchemaModel and TestTableSchemaModel test
cases starts to fail when executing 0.96.0 and trunk runAllTests maven building with IBM IBM
Java 6. Looks like the problem is related to the print order of the HashMap variables used
in ColumnSchemaModel.java and TableSchemaModel.java.
> Below are the output of the failed tests: 
> Running org.apache.hadoop.hbase.rest.model.TestColumnSchemaModel
> Tests run: 6, Failures: 1, Errors: 0, Skipped: 0, Time elapsed: 205.174 sec <<<
FAILURE!
> Running org.apache.hadoop.hbase.rest.model.TestTableSchemaModel
> Tests run: 6, Failures: 1, Errors: 0, Skipped: 0, Time elapsed: 205.174 sec <<<
FAILURE!
> Results :
> Failed tests:   testToXML(org.apache.hadoop.hbase.rest.model.TestColumnSchemaModel):
expected:<...LOCKSIZE="16384" BLO[OMFILTER="NONE" BLOCKCACHE="true" COMPRESSION="GZ" VERSIONS="1"
TTL="86400" IN_MEMORY="false]"/>> but was:<...LOCKSIZE="16384" BLO[CKCACHE="true"
VERSIONS="1" TTL="86400" COMPRESSION="GZ" IN_MEMORY="false" BLOOMFILTER="NONE]"/>>
>   testToXML(org.apache.hadoop.hbase.rest.model.TestTableSchemaModel): expected:<...LOCKSIZE="16384"
BLO[OMFILTER="NONE" BLOCKCACHE="true" COMPRESSION="GZ" VERSIONS="1" TTL="86400" IN_MEMORY="false]"/></TableSchema>>
but was:<...LOCKSIZE="16384" BLO[CKCACHE="true" VERSIONS="1" TTL="86400" COMPRESSION="GZ"
IN_MEMORY="false" BLOOMFILTER="NONE]"/></TableSchema>>

--
This message is automatically generated by JIRA.
If you think it was sent incorrectly, please contact your JIRA administrators
For more information on JIRA, see: http://www.atlassian.com/software/jira

Mime
View raw message