hbase-issues mailing list archives

Site index · List index
Message view « Date » · « Thread »
Top « Date » · « Thread »
From "Steve Loughran (JIRA)" <j...@apache.org>
Subject [jira] [Commented] (HBASE-9185) mvn site target fails when building with Maven 3.1
Date Sat, 10 Aug 2013 00:41:47 GMT

    [ https://issues.apache.org/jira/browse/HBASE-9185?page=com.atlassian.jira.plugin.system.issuetabpanels:comment-tabpanel&focusedCommentId=13735601#comment-13735601
] 

Steve Loughran commented on HBASE-9185:
---------------------------------------

full log
{code}
INFO] --- maven-site-plugin:3.2:site (default-site) @ hbase ---
[WARNING] Error injecting: org.apache.maven.reporting.exec.DefaultMavenReportExecutor
java.lang.NoClassDefFoundError: org/sonatype/aether/graph/DependencyFilter
	at java.lang.Class.getDeclaredConstructors0(Native Method)
	at java.lang.Class.privateGetDeclaredConstructors(Class.java:2437)
	at java.lang.Class.getDeclaredConstructors(Class.java:1863)
	at com.google.inject.spi.InjectionPoint.forConstructorOf(InjectionPoint.java:245)
	at com.google.inject.internal.ConstructorBindingImpl.create(ConstructorBindingImpl.java:99)
	at com.google.inject.internal.InjectorImpl.createUninitializedBinding(InjectorImpl.java:653)
	at com.google.inject.internal.InjectorImpl.createJustInTimeBinding(InjectorImpl.java:863)
	at com.google.inject.internal.InjectorImpl.createJustInTimeBindingRecursive(InjectorImpl.java:790)
	at com.google.inject.internal.InjectorImpl.getJustInTimeBinding(InjectorImpl.java:278)
	at com.google.inject.internal.InjectorImpl.getBindingOrThrow(InjectorImpl.java:210)
	at com.google.inject.internal.InjectorImpl.getProviderOrThrow(InjectorImpl.java:986)
	at com.google.inject.internal.InjectorImpl.getProvider(InjectorImpl.java:1019)
	at com.google.inject.internal.InjectorImpl.getProvider(InjectorImpl.java:982)
	at com.google.inject.internal.InjectorImpl.getInstance(InjectorImpl.java:1032)
	at org.eclipse.sisu.reflect.AbstractDeferredClass.get(AbstractDeferredClass.java:44)
	at com.google.inject.internal.ProviderInternalFactory.provision(ProviderInternalFactory.java:86)
	at com.google.inject.internal.InternalFactoryToInitializableAdapter.provision(InternalFactoryToInitializableAdapter.java:55)
	at com.google.inject.internal.ProviderInternalFactory$1.call(ProviderInternalFactory.java:70)
	at com.google.inject.internal.ProvisionListenerStackCallback$Provision.provision(ProvisionListenerStackCallback.java:100)
	at org.eclipse.sisu.plexus.lifecycles.PlexusLifecycleManager.onProvision(PlexusLifecycleManager.java:134)
	at com.google.inject.internal.ProvisionListenerStackCallback$Provision.provision(ProvisionListenerStackCallback.java:109)
	at com.google.inject.internal.ProvisionListenerStackCallback.provision(ProvisionListenerStackCallback.java:55)
	at com.google.inject.internal.ProviderInternalFactory.circularGet(ProviderInternalFactory.java:68)
	at com.google.inject.internal.InternalFactoryToInitializableAdapter.get(InternalFactoryToInitializableAdapter.java:47)
	at com.google.inject.internal.ProviderToInternalFactoryAdapter$1.call(ProviderToInternalFactoryAdapter.java:46)
	at com.google.inject.internal.InjectorImpl.callInContext(InjectorImpl.java:1054)
	at com.google.inject.internal.ProviderToInternalFactoryAdapter.get(ProviderToInternalFactoryAdapter.java:40)
	at com.google.inject.Scopes$1$1.get(Scopes.java:59)
	at com.google.inject.internal.InternalFactoryToProviderAdapter.get(InternalFactoryToProviderAdapter.java:41)
	at com.google.inject.internal.InjectorImpl$2$1.call(InjectorImpl.java:997)
	at com.google.inject.internal.InjectorImpl.callInContext(InjectorImpl.java:1047)
	at com.google.inject.internal.InjectorImpl$2.get(InjectorImpl.java:993)
	at org.eclipse.sisu.locators.LazyBeanEntry.getValue(LazyBeanEntry.java:82)
	at org.eclipse.sisu.plexus.locators.LazyPlexusBean.getValue(LazyPlexusBean.java:52)
	at org.codehaus.plexus.DefaultPlexusContainer.lookup(DefaultPlexusContainer.java:259)
	at org.codehaus.plexus.DefaultPlexusContainer.lookup(DefaultPlexusContainer.java:239)
	at org.codehaus.plexus.DefaultPlexusContainer.lookup(DefaultPlexusContainer.java:233)
	at org.apache.maven.plugins.site.AbstractSiteRenderingMojo.getReports(AbstractSiteRenderingMojo.java:229)
	at org.apache.maven.plugins.site.SiteMojo.execute(SiteMojo.java:121)
	at org.apache.maven.plugin.DefaultBuildPluginManager.executeMojo(DefaultBuildPluginManager.java:106)
	at org.apache.maven.lifecycle.internal.MojoExecutor.execute(MojoExecutor.java:208)
	at org.apache.maven.lifecycle.internal.MojoExecutor.execute(MojoExecutor.java:153)
	at org.apache.maven.lifecycle.internal.MojoExecutor.execute(MojoExecutor.java:145)
	at org.apache.maven.lifecycle.internal.LifecycleModuleBuilder.buildProject(LifecycleModuleBuilder.java:84)
	at org.apache.maven.lifecycle.internal.LifecycleModuleBuilder.buildProject(LifecycleModuleBuilder.java:59)
	at org.apache.maven.lifecycle.internal.LifecycleStarter.singleThreadedBuild(LifecycleStarter.java:183)
	at org.apache.maven.lifecycle.internal.LifecycleStarter.execute(LifecycleStarter.java:161)
	at org.apache.maven.DefaultMaven.doExecute(DefaultMaven.java:318)
	at org.apache.maven.DefaultMaven.execute(DefaultMaven.java:153)
	at org.apache.maven.cli.MavenCli.execute(MavenCli.java:555)
	at org.apache.maven.cli.MavenCli.doMain(MavenCli.java:214)
	at org.apache.maven.cli.MavenCli.main(MavenCli.java:158)
	at sun.reflect.NativeMethodAccessorImpl.invoke0(Native Method)
	at sun.reflect.NativeMethodAccessorImpl.invoke(NativeMethodAccessorImpl.java:39)
	at sun.reflect.DelegatingMethodAccessorImpl.invoke(DelegatingMethodAccessorImpl.java:25)
	at java.lang.reflect.Method.invoke(Method.java:597)
	at org.codehaus.plexus.classworlds.launcher.Launcher.launchEnhanced(Launcher.java:290)
	at org.codehaus.plexus.classworlds.launcher.Launcher.launch(Launcher.java:230)
	at org.codehaus.plexus.classworlds.launcher.Launcher.mainWithExitCode(Launcher.java:414)
	at org.codehaus.plexus.classworlds.launcher.Launcher.main(Launcher.java:357)
Caused by: java.lang.ClassNotFoundException: org.sonatype.aether.graph.DependencyFilter
	at org.codehaus.plexus.classworlds.strategy.SelfFirstStrategy.loadClass(SelfFirstStrategy.java:50)
	at org.codehaus.plexus.classworlds.realm.ClassRealm.loadClass(ClassRealm.java:244)
	at org.codehaus.plexus.classworlds.realm.ClassRealm.loadClass(ClassRealm.java:230)
	... 60 more
[INFO] ------------------------------------------------------------------------
[INFO] Reactor Summary:
[INFO] 
[INFO] HBase ............................................. FAILURE [27.236s]
[INFO] HBase - Common .................................... SKIPPED
[INFO] HBase - Protocol .................................. SKIPPED
[INFO] HBase - Client .................................... SKIPPED
[INFO] HBase - Hadoop Compatibility ...................... SKIPPED
[INFO] HBase - Hadoop Two Compatibility .................. SKIPPED
[INFO] HBase - Prefix Tree ............................... SKIPPED
[INFO] HBase - Server .................................... SKIPPED
[INFO] HBase - Integration Tests ......................... SKIPPED
[INFO] HBase - Examples .................................. SKIPPED
[INFO] HBase - Assembly .................................. SKIPPED
[INFO] ------------------------------------------------------------------------
[INFO] BUILD FAILURE
[INFO] ------------------------------------------------------------------------
[INFO] Total time: 28.074s
[INFO] Finished at: Fri Aug 09 17:31:47 PDT 2013
[INFO] Final Memory: 27M/265M
[INFO] ------------------------------------------------------------------------
[ERROR] Failed to execute goal org.apache.maven.plugins:maven-site-plugin:3.2:site (default-site)
on project hbase: Execution default-site of goal org.apache.maven.plugins:maven-site-plugin:3.2:site
failed: A required class was missing while executing org.apache.maven.plugins:maven-site-plugin:3.2:site:
org/sonatype/aether/graph/DependencyFilter
[ERROR] -----------------------------------------------------
[ERROR] realm =    plugin>org.apache.maven.plugins:maven-site-plugin:3.2
[ERROR] strategy = org.codehaus.plexus.classworlds.strategy.SelfFirstStrategy
[ERROR] urls[0] = file:/Users/stevel/.m2/repository/org/apache/maven/plugins/maven-site-plugin/3.2/maven-site-plugin-3.2.jar
[ERROR] urls[1] = file:/Users/stevel/.m2/repository/org/apache/maven/wagon/wagon-ssh/2.2/wagon-ssh-2.2.jar
[ERROR] urls[2] = file:/Users/stevel/.m2/repository/com/jcraft/jsch/0.1.44-1/jsch-0.1.44-1.jar
[ERROR] urls[3] = file:/Users/stevel/.m2/repository/org/apache/maven/wagon/wagon-ssh-common/2.2/wagon-ssh-common-2.2.jar
[ERROR] urls[4] = file:/Users/stevel/.m2/repository/org/codehaus/plexus/plexus-interactivity-api/1.0-alpha-6/plexus-interactivity-api-1.0-alpha-6.jar
[ERROR] urls[5] = file:/Users/stevel/.m2/repository/org/apache/maven/reporting/maven-reporting-exec/1.0.2/maven-reporting-exec-1.0.2.jar
[ERROR] urls[6] = file:/Users/stevel/.m2/repository/org/apache/maven/reporting/maven-reporting-api/3.0/maven-reporting-api-3.0.jar
[ERROR] urls[7] = file:/Users/stevel/.m2/repository/velocity/velocity/1.5/velocity-1.5.jar
[ERROR] urls[8] = file:/Users/stevel/.m2/repository/org/sonatype/aether/aether-util/1.7/aether-util-1.7.jar
[ERROR] urls[9] = file:/Users/stevel/.m2/repository/org/sonatype/sisu/sisu-inject-bean/1.4.2/sisu-inject-bean-1.4.2.jar
[ERROR] urls[10] = file:/Users/stevel/.m2/repository/org/sonatype/sisu/sisu-guice/2.1.7/sisu-guice-2.1.7-noaop.jar
[ERROR] urls[11] = file:/Users/stevel/.m2/repository/org/codehaus/plexus/plexus-interpolation/1.14/plexus-interpolation-1.14.jar
[ERROR] urls[12] = file:/Users/stevel/.m2/repository/org/codehaus/plexus/plexus-component-annotations/1.5.5/plexus-component-annotations-1.5.5.jar
[ERROR] urls[13] = file:/Users/stevel/.m2/repository/org/sonatype/plexus/plexus-sec-dispatcher/1.3/plexus-sec-dispatcher-1.3.jar
[ERROR] urls[14] = file:/Users/stevel/.m2/repository/org/sonatype/plexus/plexus-cipher/1.4/plexus-cipher-1.4.jar
[ERROR] urls[15] = file:/Users/stevel/.m2/repository/org/apache/maven/maven-archiver/2.4.2/maven-archiver-2.4.2.jar
[ERROR] urls[16] = file:/Users/stevel/.m2/repository/org/apache/maven/doxia/doxia-sink-api/1.3/doxia-sink-api-1.3.jar
[ERROR] urls[17] = file:/Users/stevel/.m2/repository/org/apache/maven/doxia/doxia-logging-api/1.3/doxia-logging-api-1.3.jar
[ERROR] urls[18] = file:/Users/stevel/.m2/repository/junit/junit/3.8.1/junit-3.8.1.jar
[ERROR] urls[19] = file:/Users/stevel/.m2/repository/org/apache/maven/doxia/doxia-core/1.3/doxia-core-1.3.jar
[ERROR] urls[20] = file:/Users/stevel/.m2/repository/xerces/xercesImpl/2.9.1/xercesImpl-2.9.1.jar
[ERROR] urls[21] = file:/Users/stevel/.m2/repository/xml-apis/xml-apis/1.3.04/xml-apis-1.3.04.jar
[ERROR] urls[22] = file:/Users/stevel/.m2/repository/org/apache/httpcomponents/httpclient/4.0.2/httpclient-4.0.2.jar
[ERROR] urls[23] = file:/Users/stevel/.m2/repository/commons-logging/commons-logging/1.1.1/commons-logging-1.1.1.jar
[ERROR] urls[24] = file:/Users/stevel/.m2/repository/commons-codec/commons-codec/1.3/commons-codec-1.3.jar
[ERROR] urls[25] = file:/Users/stevel/.m2/repository/org/apache/httpcomponents/httpcore/4.0.1/httpcore-4.0.1.jar
[ERROR] urls[26] = file:/Users/stevel/.m2/repository/org/apache/maven/doxia/doxia-module-xhtml/1.3/doxia-module-xhtml-1.3.jar
[ERROR] urls[27] = file:/Users/stevel/.m2/repository/org/apache/maven/doxia/doxia-module-apt/1.3/doxia-module-apt-1.3.jar
[ERROR] urls[28] = file:/Users/stevel/.m2/repository/org/apache/maven/doxia/doxia-module-xdoc/1.3/doxia-module-xdoc-1.3.jar
[ERROR] urls[29] = file:/Users/stevel/.m2/repository/org/apache/maven/doxia/doxia-module-fml/1.3/doxia-module-fml-1.3.jar
[ERROR] urls[30] = file:/Users/stevel/.m2/repository/javax/servlet/servlet-api/2.5/servlet-api-2.5.jar
[ERROR] urls[31] = file:/Users/stevel/.m2/repository/org/apache/maven/doxia/doxia-decoration-model/1.3/doxia-decoration-model-1.3.jar
[ERROR] urls[32] = file:/Users/stevel/.m2/repository/org/apache/maven/doxia/doxia-site-renderer/1.3/doxia-site-renderer-1.3.jar
[ERROR] urls[33] = file:/Users/stevel/.m2/repository/org/apache/velocity/velocity-tools/2.0/velocity-tools-2.0.jar
[ERROR] urls[34] = file:/Users/stevel/.m2/repository/commons-beanutils/commons-beanutils/1.7.0/commons-beanutils-1.7.0.jar
[ERROR] urls[35] = file:/Users/stevel/.m2/repository/commons-digester/commons-digester/1.8/commons-digester-1.8.jar
[ERROR] urls[36] = file:/Users/stevel/.m2/repository/commons-chain/commons-chain/1.1/commons-chain-1.1.jar
[ERROR] urls[37] = file:/Users/stevel/.m2/repository/commons-validator/commons-validator/1.3.1/commons-validator-1.3.1.jar
[ERROR] urls[38] = file:/Users/stevel/.m2/repository/dom4j/dom4j/1.1/dom4j-1.1.jar
[ERROR] urls[39] = file:/Users/stevel/.m2/repository/sslext/sslext/1.2-0/sslext-1.2-0.jar
[ERROR] urls[40] = file:/Users/stevel/.m2/repository/org/apache/struts/struts-core/1.3.8/struts-core-1.3.8.jar
[ERROR] urls[41] = file:/Users/stevel/.m2/repository/antlr/antlr/2.7.2/antlr-2.7.2.jar
[ERROR] urls[42] = file:/Users/stevel/.m2/repository/org/apache/struts/struts-taglib/1.3.8/struts-taglib-1.3.8.jar
[ERROR] urls[43] = file:/Users/stevel/.m2/repository/org/apache/struts/struts-tiles/1.3.8/struts-tiles-1.3.8.jar
[ERROR] urls[44] = file:/Users/stevel/.m2/repository/commons-collections/commons-collections/3.2.1/commons-collections-3.2.1.jar
[ERROR] urls[45] = file:/Users/stevel/.m2/repository/org/apache/maven/doxia/doxia-integration-tools/1.5/doxia-integration-tools-1.5.jar
[ERROR] urls[46] = file:/Users/stevel/.m2/repository/org/codehaus/plexus/plexus-archiver/1.0/plexus-archiver-1.0.jar
[ERROR] urls[47] = file:/Users/stevel/.m2/repository/org/codehaus/plexus/plexus-io/1.0/plexus-io-1.0.jar
[ERROR] urls[48] = file:/Users/stevel/.m2/repository/org/codehaus/plexus/plexus-i18n/1.0-beta-7/plexus-i18n-1.0-beta-7.jar
[ERROR] urls[49] = file:/Users/stevel/.m2/repository/org/apache/velocity/velocity/1.5/velocity-1.5.jar
[ERROR] urls[50] = file:/Users/stevel/.m2/repository/oro/oro/2.0.8/oro-2.0.8.jar
[ERROR] urls[51] = file:/Users/stevel/.m2/repository/org/codehaus/plexus/plexus-velocity/1.1.8/plexus-velocity-1.1.8.jar
[ERROR] urls[52] = file:/Users/stevel/.m2/repository/org/codehaus/plexus/plexus-utils/1.5.10/plexus-utils-1.5.10.jar
[ERROR] urls[53] = file:/Users/stevel/.m2/repository/org/mortbay/jetty/jetty/6.1.25/jetty-6.1.25.jar
[ERROR] urls[54] = file:/Users/stevel/.m2/repository/org/mortbay/jetty/servlet-api/2.5-20081211/servlet-api-2.5-20081211.jar
[ERROR] urls[55] = file:/Users/stevel/.m2/repository/org/mortbay/jetty/jetty-util/6.1.25/jetty-util-6.1.25.jar
[ERROR] urls[56] = file:/Users/stevel/.m2/repository/commons-lang/commons-lang/2.5/commons-lang-2.5.jar
[ERROR] urls[57] = file:/Users/stevel/.m2/repository/commons-io/commons-io/1.4/commons-io-1.4.jar
[ERROR] Number of foreign imports: 1
[ERROR] import: Entry[import  from realm ClassRealm[maven.api, parent: null]]
[ERROR] 
[ERROR] -----------------------------------------------------: org.sonatype.aether.graph.DependencyFilter
[ERROR] -> [Help 1]
[ERROR] 
[ERROR] To see the full stack trace of the errors, re-run Maven with the -e switch.
[ERROR] Re-run Maven using the -X switch to enable full debug logging.
[ERROR] 
[ERROR] For more information about the errors and possible solutions, please read the following
articles:
[ERROR] [Help 1] http://cwiki.apache.org/confluence/display/MAVEN/AetherClassNotFound
{code}
                
> mvn site target fails when building with Maven 3.1
> --------------------------------------------------
>
>                 Key: HBASE-9185
>                 URL: https://issues.apache.org/jira/browse/HBASE-9185
>             Project: HBase
>          Issue Type: Bug
>          Components: build
>    Affects Versions: 0.95.2
>         Environment: Apache Maven 3.1.0 (893ca28a1da9d5f51ac03827af98bb730128f9f2; 2013-06-27
19:15:32-0700)
> Java version: 1.6.0_51, vendor: Apple Inc.
> Java home: /Library/Java/JavaVirtualMachines/1.6.0_51-b11-457.jdk/Contents/Home
> Default locale: en_US, platform encoding: MacRoman
> OS name: "mac os x", version: "10.8.4", arch: "x86_64", family: "mac"
>            Reporter: Steve Loughran
>            Priority: Minor
>
> mvn site fails when building with mvn 3.1 due to various class changes inside maven.
They promise that switching to new versions of some mvn modules will result in builds that
work in both 3.0.x and 3.1:
> [https://cwiki.apache.org/confluence/display/MAVEN/AetherClassNotFound]

--
This message is automatically generated by JIRA.
If you think it was sent incorrectly, please contact your JIRA administrators
For more information on JIRA, see: http://www.atlassian.com/software/jira

Mime
View raw message