hbase-issues mailing list archives

Site index · List index
Message view « Date » · « Thread »
Top « Date » · « Thread »
From "Hudson (JIRA)" <j...@apache.org>
Subject [jira] [Commented] (HBASE-8791) Precommit hadoopqa is broke since -r1491656
Date Sun, 23 Jun 2013 07:07:21 GMT

    [ https://issues.apache.org/jira/browse/HBASE-8791?page=com.atlassian.jira.plugin.system.issuetabpanels:comment-tabpanel&focusedCommentId=13691367#comment-13691367
] 

Hudson commented on HBASE-8791:
-------------------------------

Integrated in hbase-0.95 #261 (See [https://builds.apache.org/job/hbase-0.95/261/])
    HBASE-8791 Precommit hadoopqa is broke since -r1491656 (Revision 1495796)

     Result = FAILURE
stack : 
Files : 
* /hbase/branches/0.95/hbase-it/pom.xml

                
> Precommit hadoopqa is broke since -r1491656
> -------------------------------------------
>
>                 Key: HBASE-8791
>                 URL: https://issues.apache.org/jira/browse/HBASE-8791
>             Project: HBase
>          Issue Type: Bug
>            Reporter: stack
>            Assignee: stack
>             Fix For: 0.98.0, 0.95.2
>
>         Attachments: 8791.txt
>
>
> Fails like this:
> {code}
> [INFO] ------------------------------------------------------------------------
> [INFO] BUILD FAILURE
> [INFO] ------------------------------------------------------------------------
> [INFO] Total time: 42.547s
> [INFO] Finished at: Fri Jun 21 02:43:29 UTC 2013
> [INFO] Final Memory: 48M/569M
> [INFO] ------------------------------------------------------------------------
> [ERROR] Failed to execute goal org.apache.maven.plugins:maven-compiler-plugin:2.5.1:testCompile
(default-testCompile) on project hbase-it: Compilation failure
> [ERROR] /home/jenkins/jenkins-slave/workspace/PreCommit-HBASE-Build/trunk/hbase-it/src/test/java/org/apache/hadoop/hbase/mapreduce/IntegrationTestBulkLoad.java:[589,36]
cannot access org.apache.hadoop.mapred.MiniMRCluster
> [ERROR] class file for org.apache.hadoop.mapred.MiniMRCluster not found
> [ERROR] util.startMiniMapReduceCluster();
> [ERROR] -> [Help 1]
> org.apache.maven.lifecycle.LifecycleExecutionException: Failed to execute goal org.apache.maven.plugins:maven-compiler-plugin:2.5.1:testCompile
(default-testCompile) on project hbase-it: Compilation failure
> /home/jenkins/jenkins-slave/workspace/PreCommit-HBASE-Build/trunk/hbase-it/src/test/java/org/apache/hadoop/hbase/mapreduce/IntegrationTestBulkLoad.java:[589,36]
cannot access org.apache.hadoop.mapred.MiniMRCluster
> class file for org.apache.hadoop.mapred.MiniMRCluster not found
>       util.startMiniMapReduceCluster();
> 	at org.apache.maven.lifecycle.internal.MojoExecutor.execute(MojoExecutor.java:213)
> 	at org.apache.maven.lifecycle.internal.MojoExecutor.execute(MojoExecutor.java:153)
> 	at org.apache.maven.lifecycle.internal.MojoExecutor.execute(MojoExecutor.java:145)
> 	at org.apache.maven.lifecycle.internal.LifecycleModuleBuilder.buildProject(LifecycleModuleBuilder.java:84)
> 	at org.apache.maven.lifecycle.internal.LifecycleModuleBuilder.buildProject(LifecycleModuleBuilder.java:59)
> 	at org.apache.maven.lifecycle.internal.LifecycleStarter.singleThreadedBuild(LifecycleStarter.java:183)
> 	at org.apache.maven.lifecycle.internal.LifecycleStarter.execute(LifecycleStarter.java:161)
> 	at org.apache.maven.DefaultMaven.doExecute(DefaultMaven.java:319)
> 	at org.apache.maven.DefaultMaven.execute(DefaultMaven.java:156)
> 	at org.apache.maven.cli.MavenCli.execute(MavenCli.java:537)
> 	at org.apache.maven.cli.MavenCli.doMain(MavenCli.java:196)
> 	at org.apache.maven.cli.MavenCli.main(MavenCli.java:141)
> 	at sun.reflect.NativeMethodAccessorImpl.invoke0(Native Method)
> 	at sun.reflect.NativeMethodAccessorImpl.invoke(NativeMethodAccessorImpl.java:39)
> 	at sun.reflect.DelegatingMethodAccessorImpl.invoke(DelegatingMethodAccessorImpl.java:25)
> 	at java.lang.reflect.Method.invoke(Method.java:597)
> 	at org.codehaus.plexus.classworlds.launcher.Launcher.launchEnhanced(Launcher.java:290)
> 	at org.codehaus.plexus.classworlds.launcher.Launcher.launch(Launcher.java:230)
> 	at org.codehaus.plexus.classworlds.launcher.Launcher.mainWithExitCode(Launcher.java:409)
> 	at org.codehaus.plexus.classworlds.launcher.Launcher.main(Launcher.java:352)
> Caused by: org.apache.maven.plugin.CompilationFailureException: Compilation failure
> /home/jenkins/jenkins-slave/workspace/PreCommit-HBASE-Build/trunk/hbase-it/src/test/java/org/apache/hadoop/hbase/mapreduce/IntegrationTestBulkLoad.java:[589,36]
cannot access org.apache.hadoop.mapred.MiniMRCluster
> class file for org.apache.hadoop.mapred.MiniMRCluster not found
>       util.startMiniMapReduceCluster();
> 	at org.apache.maven.plugin.AbstractCompilerMojo.execute(AbstractCompilerMojo.java:729)
> 	at org.apache.maven.plugin.TestCompilerMojo.execute(TestCompilerMojo.java:161)
> 	at org.apache.maven.plugin.DefaultBuildPluginManager.executeMojo(DefaultBuildPluginManager.java:101)
> 	at org.apache.maven.lifecycle.internal.MojoExecutor.execute(MojoExecutor.java:209)
> 	... 19 more
> {code}

--
This message is automatically generated by JIRA.
If you think it was sent incorrectly, please contact your JIRA administrators
For more information on JIRA, see: http://www.atlassian.com/software/jira

Mime
View raw message