hbase-issues mailing list archives

Site index · List index
Message view « Date » · « Thread »
Top « Date » · « Thread »
From "Jonathan Hsieh (JIRA)" <j...@apache.org>
Subject [jira] [Commented] (HBASE-8324) TestHFileOutputFormat.testMRIncremental* fails against hadoop2 profile
Date Thu, 11 Apr 2013 23:03:16 GMT

    [ https://issues.apache.org/jira/browse/HBASE-8324?page=com.atlassian.jira.plugin.system.issuetabpanels:comment-tabpanel&focusedCommentId=13629527#comment-13629527
] 

Jonathan Hsieh commented on HBASE-8324:
---------------------------------------

And it passes consistently now.

{code}
$ $ mvn clean  -Dmaven.test.redirectOutputToFile=true test -Dtest=TestHFileOutputFormat#testMRIncre*
-Dhadoop.profile=2.0
...
-------------------------------------------------------
 T E S T S
-------------------------------------------------------
Running org.apache.hadoop.hbase.mapreduce.TestHFileOutputFormat
Tests run: 2, Failures: 0, Errors: 0, Skipped: 0, Time elapsed: 113.794 sec

{code}
                
> TestHFileOutputFormat.testMRIncremental* fails against hadoop2 profile
> ----------------------------------------------------------------------
>
>                 Key: HBASE-8324
>                 URL: https://issues.apache.org/jira/browse/HBASE-8324
>             Project: HBase
>          Issue Type: Sub-task
>          Components: hadoop2, test
>    Affects Versions: 0.95.0
>            Reporter: Jonathan Hsieh
>            Assignee: Jonathan Hsieh
>             Fix For: 0.95.1
>
>
> Two tests cases are failing:
> testMRIncrementalLoad, testMRIncrementalloadWithSplit
> {code}
> <testcase time="33.942" classname="org.apache.hadoop.hbase.mapreduce.TestHFileOutputFormat"
name="testMRIncrementalLoad">
>     <failure type="java.lang.AssertionError">java.lang.AssertionError
>         at org.junit.Assert.fail(Assert.java:86)
>         at org.junit.Assert.assertTrue(Assert.java:41)
>         at org.junit.Assert.assertTrue(Assert.java:52)
>         at org.apache.hadoop.hbase.mapreduce.TestHFileOutputFormat.runIncrementalPELoad(TestHFileOutputFormat.java:468)
>         at org.apache.hadoop.hbase.mapreduce.TestHFileOutputFormat.doIncrementalLoadTest(TestHFileOutputFormat.java:378)
>         at org.apache.hadoop.hbase.mapreduce.TestHFileOutputFormat.testMRIncrementalLoad(TestHFileOutputFormat.java:348)
>         at sun.reflect.NativeMethodAccessorImpl.invoke0(Native Method)
> ...
>   <testcase time="34.324" classname="org.apache.hadoop.hbase.mapreduce.TestHFileOutputFormat"
name="testMRIncrementalLoadWithSplit">
>     <failure type="java.lang.AssertionError">java.lang.AssertionError
>         at org.junit.Assert.fail(Assert.java:86)
>         at org.junit.Assert.assertTrue(Assert.java:41)
>         at org.junit.Assert.assertTrue(Assert.java:52)
>         at org.apache.hadoop.hbase.mapreduce.TestHFileOutputFormat.runIncrementalPELoad(TestHFileOutputFormat.java:468)
>         at org.apache.hadoop.hbase.mapreduce.TestHFileOutputFormat.doIncrementalLoadTest(TestHFileOutputFormat.java:378)
>         at org.apache.hadoop.hbase.mapreduce.TestHFileOutputFormat.testMRIncrementalLoadWithSplit(TestHFileOutputFormat.java:354)
>         at sun.reflect.NativeMethodAccessorImpl.invoke0(Native Method)
>         ...
> {code}

--
This message is automatically generated by JIRA.
If you think it was sent incorrectly, please contact your JIRA administrators
For more information on JIRA, see: http://www.atlassian.com/software/jira

Mime
View raw message