hbase-issues mailing list archives

Site index · List index
Message view « Date » · « Thread »
Top « Date » · « Thread »
From "Lars George (JIRA)" <j...@apache.org>
Subject [jira] [Commented] (HBASE-6513) Test errors when building on MacOS
Date Tue, 05 Feb 2013 20:55:13 GMT

    [ https://issues.apache.org/jira/browse/HBASE-6513?page=com.atlassian.jira.plugin.system.issuetabpanels:comment-tabpanel&focusedCommentId=13571715#comment-13571715
] 

Lars George commented on HBASE-6513:
------------------------------------

I have committed the 0.96 patch, but my 0.94 test run fails. I am trying 

{code}
mvn -e test -Dtest=TestRegionSplitCalculator
{code}

but am getting this

{code}
...
-------------------------------------------------------
 T E S T S
-------------------------------------------------------
Running org.apache.hadoop.hbase.util.TestRegionSplitCalculator
Tests run: 15, Failures: 0, Errors: 0, Skipped: 0, Time elapsed: 0.336 sec

Results :

Tests run: 15, Failures: 0, Errors: 0, Skipped: 0
...
[INFO] BUILD FAILURE
[INFO] ------------------------------------------------------------------------
[INFO] Total time: 7.745s
[INFO] Finished at: Tue Feb 05 21:10:15 CET 2013
[INFO] Final Memory: 22M/81M
[INFO] ------------------------------------------------------------------------
[ERROR] Failed to execute goal org.apache.maven.plugins:maven-surefire-plugin:2.12-TRUNK-HBASE-2:test
(secondPartTestsExecution) on project hbase: No tests were executed!  (Set -DfailIfNoTests=false
to ignore this error.) -> [Help 1]
[ERROR] 
{code}

Any idea why? It compiles fine, so I would assume that all is fine. The tests seems to run
fine and report no error. But overall Maven thinks I am not running any tests? Hints?
                
> Test errors when building on MacOS
> ----------------------------------
>
>                 Key: HBASE-6513
>                 URL: https://issues.apache.org/jira/browse/HBASE-6513
>             Project: HBase
>          Issue Type: Bug
>          Components: build
>    Affects Versions: 0.96.0
>         Environment: MacOSX 10.8 
> Oracle JDK 1.7
>            Reporter: Archimedes Trajano
>            Assignee: Lars Francke
>             Fix For: 0.96.0
>
>         Attachments: HBASE-6513.1.extended.0.94.patch, HBASE-6513.1.extended.patch, HBASE-6513.1.patch
>
>
> Results :
> Failed tests:   testBackgroundEvictionThread[0](org.apache.hadoop.hbase.io.hfile.TestLruBlockCache):
expected:<2> but was:<1>
>   testBackgroundEvictionThread[1](org.apache.hadoop.hbase.io.hfile.TestLruBlockCache):
expected:<2> but was:<1>
>   testSplitCalculatorEq(org.apache.hadoop.hbase.util.TestRegionSplitCalculator): expected:<2>
but was:<1>

--
This message is automatically generated by JIRA.
If you think it was sent incorrectly, please contact your JIRA administrators
For more information on JIRA, see: http://www.atlassian.com/software/jira

Mime
View raw message