hbase-issues mailing list archives

Site index · List index
Message view « Date » · « Thread »
Top « Date » · « Thread »
From "Hadoop QA (JIRA)" <j...@apache.org>
Subject [jira] [Commented] (HBASE-6945) Compilation errors when using non-Sun JDKs to build HBase-0.94
Date Thu, 18 Oct 2012 23:08:03 GMT

    [ https://issues.apache.org/jira/browse/HBASE-6945?page=com.atlassian.jira.plugin.system.issuetabpanels:comment-tabpanel&focusedCommentId=13479460#comment-13479460
] 

Hadoop QA commented on HBASE-6945:
----------------------------------

{color:red}-1 overall{color}.  Here are the results of testing the latest attachment 
  http://issues.apache.org/jira/secure/attachment/12549710/ResourceCheckerJUnitListener_HBASE_6945-trunk.patch
  against trunk revision .

    {color:green}+1 @author{color}.  The patch does not contain any @author tags.

    {color:green}+1 tests included{color}.  The patch appears to include 2 new or modified
tests.

    {color:green}+1 hadoop2.0{color}.  The patch compiles against the hadoop 2.0 profile.

    {color:red}-1 javadoc{color}.  The javadoc tool appears to have generated 82 warning messages.

    {color:green}+1 javac{color}.  The applied patch does not increase the total number of
javac compiler warnings.

    {color:red}-1 findbugs{color}.  The patch appears to introduce 4 new Findbugs (version
1.3.9) warnings.

    {color:green}+1 release audit{color}.  The applied patch does not increase the total number
of release audit warnings.

     {color:red}-1 core tests{color}.  The patch failed these unit tests:
                       org.apache.hadoop.hbase.security.access.TestZKPermissionsWatcher

Test results: https://builds.apache.org/job/PreCommit-HBASE-Build/3084//testReport/
Findbugs warnings: https://builds.apache.org/job/PreCommit-HBASE-Build/3084//artifact/trunk/patchprocess/newPatchFindbugsWarningshbase-hadoop2-compat.html
Findbugs warnings: https://builds.apache.org/job/PreCommit-HBASE-Build/3084//artifact/trunk/patchprocess/newPatchFindbugsWarningshbase-hadoop1-compat.html
Findbugs warnings: https://builds.apache.org/job/PreCommit-HBASE-Build/3084//artifact/trunk/patchprocess/newPatchFindbugsWarningshbase-common.html
Findbugs warnings: https://builds.apache.org/job/PreCommit-HBASE-Build/3084//artifact/trunk/patchprocess/newPatchFindbugsWarningshbase-server.html
Findbugs warnings: https://builds.apache.org/job/PreCommit-HBASE-Build/3084//artifact/trunk/patchprocess/newPatchFindbugsWarningshbase-hadoop-compat.html
Console output: https://builds.apache.org/job/PreCommit-HBASE-Build/3084//console

This message is automatically generated.
                
> Compilation errors when using non-Sun JDKs to build HBase-0.94
> --------------------------------------------------------------
>
>                 Key: HBASE-6945
>                 URL: https://issues.apache.org/jira/browse/HBASE-6945
>             Project: HBase
>          Issue Type: Bug
>          Components: build
>    Affects Versions: 0.94.1
>         Environment: RHEL 6.3, IBM Java 7 
>            Reporter: Kumar Ravi
>            Assignee: Kumar Ravi
>              Labels: patch
>             Fix For: 0.94.3
>
>         Attachments: ResourceCheckerJUnitListener_HBASE_6945-trunk.patch
>
>
> When using IBM Java 7 to build HBase-0.94.1, the following comilation error is seen.

> [INFO] -------------------------------------------------------------
> [ERROR] COMPILATION ERROR : 
> [INFO] -------------------------------------------------------------
> [ERROR] /home/hadoop/hbase-0.94/src/test/java/org/apache/hadoop/hbase/ResourceChecker.java:[23,25]
error: package com.sun.management does not exist
> [ERROR] /home/hadoop/hbase-0.94/src/test/java/org/apache/hadoop/hbase/ResourceChecker.java:[46,25]
error: cannot find symbol
> [ERROR]   symbol:   class UnixOperatingSystemMXBean
>   location: class ResourceAnalyzer
> /home/hadoop/hbase-0.94/src/test/java/org/apache/hadoop/hbase/ResourceChecker.java:[75,29]
error: cannot find symbol
> [ERROR]   symbol:   class UnixOperatingSystemMXBean
>   location: class ResourceAnalyzer
> /home/hadoop/hbase-0.94/src/test/java/org/apache/hadoop/hbase/ResourceChecker.java:[76,23]
error: cannot find symbol
> [INFO] 4 errors 
> [INFO] -------------------------------------------------------------
> [INFO] ------------------------------------------------------------------------
> [INFO] BUILD FAILURE
> [INFO] ------------------------------------------------------------------------
>  I have a patch available which should work for all JDKs including Sun.
>  I am in the process of testing this patch. Preliminary tests indicate the build is working
fine with this patch. I will post this patch when I am done testing.

--
This message is automatically generated by JIRA.
If you think it was sent incorrectly, please contact your JIRA administrators
For more information on JIRA, see: http://www.atlassian.com/software/jira

Mime
View raw message