hbase-issues mailing list archives

Site index · List index
Message view « Date » · « Thread »
Top « Date » · « Thread »
From "Hadoop QA (JIRA)" <j...@apache.org>
Subject [jira] [Commented] (HBASE-5861) Hadoop 23 compile broken due to tests introduced in HBASE-5064
Date Wed, 25 Apr 2012 00:30:06 GMT

    [ https://issues.apache.org/jira/browse/HBASE-5861?page=com.atlassian.jira.plugin.system.issuetabpanels:comment-tabpanel&focusedCommentId=13261171#comment-13261171
] 

Hadoop QA commented on HBASE-5861:
----------------------------------

-1 overall.  Here are the results of testing the latest attachment 
  http://issues.apache.org/jira/secure/attachment/12524083/5861-v4.patch
  against trunk revision .

    +1 @author.  The patch does not contain any @author tags.

    +1 tests included.  The patch appears to include 9 new or modified tests.

    +1 javadoc.  The javadoc tool did not generate any warning messages.

    +1 javac.  The applied patch does not increase the total number of javac compiler warnings.

    -1 findbugs.  The patch appears to introduce 5 new Findbugs (version 1.3.9) warnings.

    +1 release audit.  The applied patch does not increase the total number of release audit
warnings.

     -1 core tests.  The patch failed these unit tests:
                       org.apache.hadoop.hbase.TestRegionRebalancing

Test results: https://builds.apache.org/job/PreCommit-HBASE-Build/1633//testReport/
Findbugs warnings: https://builds.apache.org/job/PreCommit-HBASE-Build/1633//artifact/trunk/patchprocess/newPatchFindbugsWarnings.html
Console output: https://builds.apache.org/job/PreCommit-HBASE-Build/1633//console

This message is automatically generated.
                
> Hadoop 23 compile broken due to tests introduced in HBASE-5064 
> ---------------------------------------------------------------
>
>                 Key: HBASE-5861
>                 URL: https://issues.apache.org/jira/browse/HBASE-5861
>             Project: HBase
>          Issue Type: Bug
>          Components: test
>    Affects Versions: 0.94.0, 0.96.0
>            Reporter: Jonathan Hsieh
>            Assignee: Jonathan Hsieh
>            Priority: Blocker
>             Fix For: 0.94.0, 0.96.0
>
>         Attachments: 5861-v4.patch, 5861.txt, hbase-5861-jon.patch, hbase-5861-v2.patch,
hbase-5861-v3.patch
>
>
> When attempting to compile HBase 0.94rc1 against hadoop 23, I got this set of compilation
error messages:
> {code}
> jon@swoop:~/proj/hbase-0.94$ mvn clean test -Dhadoop.profile=23 -DskipTests
> ...
> [INFO] ------------------------------------------------------------------------
> [INFO] BUILD FAILURE
> [INFO] ------------------------------------------------------------------------
> [INFO] Total time: 18.926s
> [INFO] Finished at: Mon Apr 23 10:38:47 PDT 2012
> [INFO] Final Memory: 55M/555M
> [INFO] ------------------------------------------------------------------------
> [ERROR] Failed to execute goal org.apache.maven.plugins:maven-compiler-plugin:2.0.2:testCompile
(default-testCompile) on project hbase: Compilation failure: Compilation failure:
> [ERROR] /home/jon/proj/hbase-0.94/src/test/java/org/apache/hadoop/hbase/mapreduce/TestHLogRecordReader.java:[147,46]
org.apache.hadoop.mapreduce.JobContext is abstract; cannot be instantiated
> [ERROR] 
> [ERROR] /home/jon/proj/hbase-0.94/src/test/java/org/apache/hadoop/hbase/mapreduce/TestHLogRecordReader.java:[153,29]
org.apache.hadoop.mapreduce.JobContext is abstract; cannot be instantiated
> [ERROR] 
> [ERROR] /home/jon/proj/hbase-0.94/src/test/java/org/apache/hadoop/hbase/mapreduce/TestHLogRecordReader.java:[194,46]
org.apache.hadoop.mapreduce.JobContext is abstract; cannot be instantiated
> [ERROR] 
> [ERROR] /home/jon/proj/hbase-0.94/src/test/java/org/apache/hadoop/hbase/mapreduce/TestHLogRecordReader.java:[206,29]
org.apache.hadoop.mapreduce.JobContext is abstract; cannot be instantiated
> [ERROR] 
> [ERROR] /home/jon/proj/hbase-0.94/src/test/java/org/apache/hadoop/hbase/mapreduce/TestHLogRecordReader.java:[213,29]
org.apache.hadoop.mapreduce.JobContext is abstract; cannot be instantiated
> [ERROR] 
> [ERROR] /home/jon/proj/hbase-0.94/src/test/java/org/apache/hadoop/hbase/mapreduce/TestHLogRecordReader.java:[226,29]
org.apache.hadoop.mapreduce.TaskAttemptContext is abstract; cannot be instantiated
> [ERROR] -> [Help 1]
> {code}
> Upon further investigation this issue is due to code introduced in HBASE-5064 and is
also present in trunk.  

--
This message is automatically generated by JIRA.
If you think it was sent incorrectly, please contact your JIRA administrators: https://issues.apache.org/jira/secure/ContactAdministrators!default.jspa
For more information on JIRA, see: http://www.atlassian.com/software/jira

        

Mime
View raw message