hbase-issues mailing list archives

Site index · List index
Message view « Date » · « Thread »
Top « Date » · « Thread »
From "stack (Commented) (JIRA)" <j...@apache.org>
Subject [jira] [Commented] (HBASE-5317) Fix TestHFileOutputFormat to work against hadoop 0.23
Date Sat, 18 Feb 2012 21:53:59 GMT

    [ https://issues.apache.org/jira/browse/HBASE-5317?page=com.atlassian.jira.plugin.system.issuetabpanels:comment-tabpanel&focusedCommentId=13211118#comment-13211118
] 

stack commented on HBASE-5317:
------------------------------

Gregory it failed with this:

{code}
[INFO] --- maven-compiler-plugin:2.0.2:testCompile (default-testCompile) @ hbase ---
[INFO] Compiling 331 source files to /home/jenkins/jenkins-slave/workspace/PreCommit-HBASE-Build/trunk/target/test-classes
[INFO] ------------------------------------------------------------------------
[INFO] BUILD FAILURE
[INFO] ------------------------------------------------------------------------
[INFO] Total time: 23.287s
[INFO] Finished at: Sat Feb 18 01:46:56 UTC 2012
[INFO] Final Memory: 41M/424M
[INFO] ------------------------------------------------------------------------
[ERROR] Failed to execute goal org.apache.maven.plugins:maven-compiler-plugin:2.0.2:testCompile
(default-testCompile) on project hbase: Compilation failure
[ERROR] /home/jenkins/jenkins-slave/workspace/PreCommit-HBASE-Build/trunk/src/test/java/org/apache/hadoop/hbase/client/TestMetaMigrationRemovingHTD.java:[79,33]
cannot find symbol
[ERROR] symbol  : method getDefaultRootDirPath()
[ERROR] location: class org.apache.hadoop.hbase.HBaseTestingUtility
[ERROR] -> [Help 1]
{code}


What you reckon thats about?  Is it the 0.23 profile? leaking?
                
> Fix TestHFileOutputFormat to work against hadoop 0.23
> -----------------------------------------------------
>
>                 Key: HBASE-5317
>                 URL: https://issues.apache.org/jira/browse/HBASE-5317
>             Project: HBase
>          Issue Type: Bug
>          Components: test
>    Affects Versions: 0.94.0, 0.92.0
>            Reporter: Gregory Chanan
>            Assignee: Gregory Chanan
>         Attachments: HBASE-5317-v0.patch, HBASE-5317-v1.patch, HBASE-5317-v3.patch
>
>
> Running
> mvn -Dhadoop.profile=23 test -P localTests -Dtest=org.apache.hadoop.hbase.mapreduce.TestHFileOutputFormat
> yields this on 0.92:
> Failed tests:   testColumnFamilyCompression(org.apache.hadoop.hbase.mapreduce.TestHFileOutputFormat):
HFile for column family info-A not found
> Tests in error: 
>   test_TIMERANGE(org.apache.hadoop.hbase.mapreduce.TestHFileOutputFormat): /home/gchanan/workspace/apache92/target/test-data/276cbd0c-c771-4f81-9ba8-c464c9dd7486/test_TIMERANGE_present/_temporary/0/_temporary/_attempt_200707121733_0001_m_000000_0
(Is a directory)
>   testMRIncrementalLoad(org.apache.hadoop.hbase.mapreduce.TestHFileOutputFormat): TestTable
>   testMRIncrementalLoadWithSplit(org.apache.hadoop.hbase.mapreduce.TestHFileOutputFormat):
TestTable
> It looks like on trunk, this also results in an error:
>   testExcludeMinorCompaction(org.apache.hadoop.hbase.mapreduce.TestHFileOutputFormat):
TestTable
> I have a patch that fixes testColumnFamilyCompression and test_TIMERANGE, but haven't
fixed the other 3 yet.

--
This message is automatically generated by JIRA.
If you think it was sent incorrectly, please contact your JIRA administrators: https://issues.apache.org/jira/secure/ContactAdministrators!default.jspa
For more information on JIRA, see: http://www.atlassian.com/software/jira

        

Mime
View raw message