hbase-issues mailing list archives

Site index · List index
Message view « Date » · « Thread »
Top « Date » · « Thread »
From "HBase Review Board (JIRA)" <j...@apache.org>
Subject [jira] Commented: (HBASE-3235) Intermittent incrementColumnValue failure in TestHRegion
Date Tue, 16 Nov 2010 08:47:17 GMT

    [ https://issues.apache.org/jira/browse/HBASE-3235?page=com.atlassian.jira.plugin.system.issuetabpanels:comment-tabpanel&focusedCommentId=12932385#action_12932385
] 

HBase Review Board commented on HBASE-3235:
-------------------------------------------

Message from: "Andrew Purtell" <apurtell@apache.org>

-----------------------------------------------------------
This is an automatically generated e-mail. To reply, visit:
http://review.cloudera.org/r/1224/#review1937
-----------------------------------------------------------

Ship it!


I believe the TestHLog failure noted was on our Hudson. If so it is unrelated to this change.


- Andrew





> Intermittent incrementColumnValue failure in TestHRegion
> --------------------------------------------------------
>
>                 Key: HBASE-3235
>                 URL: https://issues.apache.org/jira/browse/HBASE-3235
>             Project: HBase
>          Issue Type: Bug
>          Components: regionserver
>    Affects Versions: 0.90.0
>            Reporter: Gary Helmling
>
> I first saw this in a Hudson build, but can reproduce locally with enough test runs (5-10
times):
> {noformat}
> -------------------------------------------------------------------------------
> Test set: org.apache.hadoop.hbase.regionserver.TestHRegion
> -------------------------------------------------------------------------------
> Tests run: 51, Failures: 1, Errors: 0, Skipped: 0, Time elapsed: 39.413 sec <<<
FAILURE!
> testIncrementColumnValue_UpdatingInPlace(org.apache.hadoop.hbase.regionserver.TestHRegion)
 Time elapsed: 0.079 sec  <<< FAILURE!
> junit.framework.AssertionFailedError: expected:<1> but was:<2>
>         at junit.framework.Assert.fail(Assert.java:47)
>         at junit.framework.Assert.failNotEquals(Assert.java:283)
>         at junit.framework.Assert.assertEquals(Assert.java:64)
>         at junit.framework.Assert.assertEquals(Assert.java:195)
>         at junit.framework.Assert.assertEquals(Assert.java:201)
>         at org.apache.hadoop.hbase.regionserver.TestHRegion.testIncrementColumnValue_UpdatingInPlace(TestHRegion.java:1889)
>         at sun.reflect.NativeMethodAccessorImpl.invoke0(Native Method)
> {noformat}
> Alternately, the failure can also show up in testIncrementColumnValue_UpdatingInPlace_Negative():
> {noformat}
> testIncrementColumnValue_UpdatingInPlace_Negative(org.apache.hadoop.hbase.regionserver.TestHRegion)
 Time elapsed: 0.03 sec  <<< FAILURE!
> junit.framework.AssertionFailedError: expected:<2> but was:<3>
>         at junit.framework.Assert.fail(Assert.java:47)
>         at junit.framework.Assert.failNotEquals(Assert.java:283)
>         at junit.framework.Assert.assertEquals(Assert.java:64)
>         at junit.framework.Assert.assertEquals(Assert.java:130)
>         at junit.framework.Assert.assertEquals(Assert.java:136)
>         at
> org.apache.hadoop.hbase.regionserver.TestHRegion.assertICV(TestHRegion.java:2081)
>         at
> org.apache.hadoop.hbase.regionserver.TestHRegion.testIncrementColumnValue_UpdatingInPlace_Negative(TestHRegion.java:1990)
>         at sun.reflect.NativeMethodAccessorImpl.invoke0(Native Method)
> {noformat}

-- 
This message is automatically generated by JIRA.
-
You can reply to this email to add a comment to the issue online.


Mime
View raw message