hbase-issues mailing list archives

Site index · List index
Message view « Date » · « Thread »
Top « Date » · « Thread »
From "stack (JIRA)" <j...@apache.org>
Subject [jira] Commented: (HBASE-2329) [maven] mvn install breaks running tests, it does not include hbase classes
Date Tue, 16 Mar 2010 17:02:27 GMT

    [ https://issues.apache.org/jira/browse/HBASE-2329?page=com.atlassian.jira.plugin.system.issuetabpanels:comment-tabpanel&focusedCommentId=12845999#action_12845999

stack commented on HBASE-2329:

Here is some more on this.  On my work machine, if I first do 'mvn test-compile', subsequent
calls to 'mvn install' work.

Also, on mac at home, after updating, I fell into the badness this issue describes in that
the 'mvn install' failed to compile.  At  home, doing first the 'mvn test-compile' made it
so I could do 'mvn install' w/o build failures.

> [maven] mvn install breaks running tests, it does not include hbase classes
> ---------------------------------------------------------------------------
>                 Key: HBASE-2329
>                 URL: https://issues.apache.org/jira/browse/HBASE-2329
>             Project: Hadoop HBase
>          Issue Type: Bug
>            Reporter: stack
>             Fix For: 0.21.0
> In current trunk, mvn install is broke.  Test compilation fails:
> {code}
> [INFO] [resources:testResources {execution: default-testResources}]
> [INFO] Using 'UTF-8' encoding to copy filtered resources.
> [INFO] Copying 4 resources
> [INFO] [compiler:testCompile {execution: default-testCompile}]
> [INFO] Compiling 101 source files to /Users/Stack/checkouts/trunk/core/target/test-classes
> [INFO] -------------------------------------------------------------
> [INFO] -------------------------------------------------------------
> [ERROR] /Users/Stack/checkouts/trunk/core/src/test/java/org/apache/hadoop/hbase/io/hfile/TestSeekTo.java:[26,30]
[deprecation] org.apache.hadoop.hbase.HBaseTestCase in org.apache.hadoop.hbase has been deprecated
> [ERROR] /Users/Stack/checkouts/trunk/core/src/test/java/org/apache/hadoop/hbase/io/hfile/TestSeekTo.java:[27,35]
cannot find symbol
> symbol  : class Bytes
> location: package org.apache.hadoop.hbase.util
> [ERROR] /Users/Stack/checkouts/trunk/core/src/test/java/org/apache/hadoop/hbase/HBaseTestCase.java:[36,37]
cannot find symbol
> symbol  : class Delete
> location: package org.apache.hadoop.hbase.client
> ...
> {code}
> It does not seem to be able to find hbase classes.

This message is automatically generated by JIRA.
You can reply to this email to add a comment to the issue online.

View raw message