hbase-dev mailing list archives

Site index · List index
Message view « Date » · « Thread »
Top « Date » · « Thread »
From "Guanghao Zhang (Jira)" <j...@apache.org>
Subject [jira] [Resolved] (HBASE-24080) [flakey test] TestRegionReplicaFailover.testSecondaryRegionKill fails.
Date Thu, 14 May 2020 04:13:00 GMT

     [ https://issues.apache.org/jira/browse/HBASE-24080?page=com.atlassian.jira.plugin.system.issuetabpanels:all-tabpanel
]

Guanghao Zhang resolved HBASE-24080.
------------------------------------
    Resolution: Fixed

> [flakey test] TestRegionReplicaFailover.testSecondaryRegionKill fails.
> ----------------------------------------------------------------------
>
>                 Key: HBASE-24080
>                 URL: https://issues.apache.org/jira/browse/HBASE-24080
>             Project: HBase
>          Issue Type: Test
>          Components: read replicas
>    Affects Versions: 3.0.0-alpha-1, 2.3.0
>            Reporter: Huaxiang Sun
>            Assignee: Huaxiang Sun
>            Priority: Major
>             Fix For: 3.0.0-alpha-1, 2.3.0, 2.2.5
>
>
> Run into the following error locally:
> {code:java}
> -------------------------------------------------------------------------------
> Test set: org.apache.hadoop.hbase.regionserver.TestRegionReplicaFailover
> -------------------------------------------------------------------------------
> Tests run: 6, Failures: 1, Errors: 0, Skipped: 0, Time elapsed: 97.391 s <<<
FAILURE! - in org.apache.hadoop.hbase.regionserver.TestRegionReplicaFailover
> org.apache.hadoop.hbase.regionserver.TestRegionReplicaFailover.testSecondaryRegionKill 
Time elapsed: 28.682 s  <<< FAILURE!
> java.lang.AssertionError: Failed verification of row :0
>         at org.junit.Assert.fail(Assert.java:89)
>         at org.junit.Assert.assertTrue(Assert.java:42)
>         at org.apache.hadoop.hbase.HBaseTestingUtility.verifyNumericRows(HBaseTestingUtility.java:2407)
>         at org.apache.hadoop.hbase.regionserver.TestRegionReplicaFailover.testSecondaryRegionKill(TestRegionReplicaFailover.java:240)
>         at sun.reflect.NativeMethodAccessorImpl.invoke0(Native Method)
>         at sun.reflect.NativeMethodAccessorImpl.invoke(NativeMethodAccessorImpl.java:62)
>         at sun.reflect.DelegatingMethodAccessorImpl.invoke(DelegatingMethodAccessorImpl.java:43)
>         at java.lang.reflect.Method.invoke(Method.java:498)
>         at org.junit.runners.model.FrameworkMethod$1.runReflectiveCall(FrameworkMethod.java:59)
>         at org.junit.internal.runners.model.ReflectiveCallable.run(ReflectiveCallable.java:12)
>         at org.junit.runners.model.FrameworkMethod.invokeExplosively(FrameworkMethod.java:56)
>         at org.junit.internal.runners.statements.InvokeMethod.evaluate(InvokeMethod.java:17)
>         at org.junit.internal.runners.statements.RunBefores.evaluate(RunBefores.java:26)
>         at org.junit.internal.runners.statements.RunAfters.evaluate(RunAfters.java:27)
>         at org.junit.rules.TestWatcher$1.evaluate(TestWatcher.java:61)
>         at org.junit.runners.ParentRunner$3.evaluate(ParentRunner.java:306)
>         at org.junit.runners.BlockJUnit4ClassRunner$1.evaluate(BlockJUnit4ClassRunner.java:100)
>         at org.junit.runners.ParentRunner.runLeaf(ParentRunner.java:366)
>         at org.junit.runners.BlockJUnit4ClassRunner.runChild(BlockJUnit4ClassRunner.java:103)
>         at org.junit.runners.BlockJUnit4ClassRunner.runChild(BlockJUnit4ClassRunner.java:63)
>         at org.junit.runners.ParentRunner$4.run(ParentRunner.java:331)
>         at org.junit.runners.ParentRunner$1.schedule(ParentRunner.java:79)
>         at org.junit.runners.ParentRunner.runChildren(ParentRunner.java:329)
>         at org.junit.runners.ParentRunner.access$100(ParentRunner.java:66)
>         at org.junit.runners.ParentRunner$2.evaluate(ParentRunner.java:293)
>         at org.junit.internal.runners.statements.FailOnTimeout$CallableStatement.call(FailOnTimeout.java:288)
>         at org.junit.internal.runners.statements.FailOnTimeout$CallableStatement.call(FailOnTimeout.java:282)
>         at java.util.concurrent.FutureTask.run(FutureTask.java:266)
>         at java.lang.Thread.run(Thread.java:748) {code}



--
This message was sent by Atlassian Jira
(v8.3.4#803005)

Mime
View raw message