hbase-dev mailing list archives

Site index · List index
Message view « Date » · « Thread »
Top « Date » · « Thread »
From "Michael Stack (Jira)" <j...@apache.org>
Subject [jira] [Reopened] (HBASE-24175) [Flakey Tests] TestSecureExportSnapshot FileNotFoundException
Date Wed, 15 Apr 2020 15:38:00 GMT

     [ https://issues.apache.org/jira/browse/HBASE-24175?page=com.atlassian.jira.plugin.system.issuetabpanels:all-tabpanel
]

Michael Stack reopened HBASE-24175:
-----------------------------------

The patch here doesn't get all places where yarn is using /tmp. The 2.3 build failed with
the below last night:

{code}
Error Message

org.apache.hadoop.service.ServiceStateException: java.io.FileNotFoundException: File file:/tmp/hadoop-yarn-jenkins/node-attribute/nodeattribute.mirror.writing
does not exist

Stacktrace

org.apache.hadoop.yarn.exceptions.YarnRuntimeException: org.apache.hadoop.service.ServiceStateException:
java.io.FileNotFoundException: File file:/tmp/hadoop-yarn-jenkins/node-attribute/nodeattribute.mirror.writing
does not exist
	at org.apache.hadoop.hbase.snapshot.TestExportSnapshotAdjunct.setUpBeforeClass(TestExportSnapshotAdjunct.java:70)
Caused by: org.apache.hadoop.service.ServiceStateException: java.io.FileNotFoundException:
File file:/tmp/hadoop-yarn-jenkins/node-attribute/nodeattribute.mirror.writing does not exist
	at org.apache.hadoop.hbase.snapshot.TestExportSnapshotAdjunct.setUpBeforeClass(TestExportSnapshotAdjunct.java:70)
Caused by: java.io.FileNotFoundException: File file:/tmp/hadoop-yarn-jenkins/node-attribute/nodeattribute.mirror.writing
does not exist
	at org.apache.hadoop.hbase.snapshot.TestExportSnapshotAdjunct.setUpBeforeClass(TestExportSnapshotAdjunct.java:70)
{code}

> [Flakey Tests] TestSecureExportSnapshot FileNotFoundException
> -------------------------------------------------------------
>
>                 Key: HBASE-24175
>                 URL: https://issues.apache.org/jira/browse/HBASE-24175
>             Project: HBase
>          Issue Type: Sub-task
>          Components: flakies
>            Reporter: Michael Stack
>            Assignee: Michael Stack
>            Priority: Major
>             Fix For: 3.0.0, 2.3.0, 2.2.5
>
>         Attachments: 0001-HBASE-24175-Flakey-Tests-TestSecureExportSnapshot-Fi.patch
>
>
> Why we writing '/tmp' dir?
> {code}
> Error Message
> org.apache.hadoop.service.ServiceStateException: java.io.FileNotFoundException: File
file:/tmp/hadoop-yarn-jenkins/node-attribute/nodeattribute.mirror.writing does not exist
> Stacktrace
> org.apache.hadoop.yarn.exceptions.YarnRuntimeException: org.apache.hadoop.service.ServiceStateException:
java.io.FileNotFoundException: File file:/tmp/hadoop-yarn-jenkins/node-attribute/nodeattribute.mirror.writing
does not exist
> 	at org.apache.hadoop.hbase.snapshot.TestSecureExportSnapshot.setUpBeforeClass(TestSecureExportSnapshot.java:56)
> Caused by: org.apache.hadoop.service.ServiceStateException: java.io.FileNotFoundException:
File file:/tmp/hadoop-yarn-jenkins/node-attribute/nodeattribute.mirror.writing does not exist
> 	at org.apache.hadoop.hbase.snapshot.TestSecureExportSnapshot.setUpBeforeClass(TestSecureExportSnapshot.java:56)
> Caused by: java.io.FileNotFoundException: File file:/tmp/hadoop-yarn-jenkins/node-attribute/nodeattribute.mirror.writing
does not exist
> 	at org.apache.hadoop.hbase.snapshot.TestSecureExportSnapshot.setUpBeforeClass(TestSecureExportSnapshot.java:56)
> {code}



--
This message was sent by Atlassian Jira
(v8.3.4#803005)

Mime
View raw message