hbase-dev mailing list archives

Site index · List index
Message view « Date » · « Thread »
Top « Date » · « Thread »
From "Guanghao Zhang (JIRA)" <j...@apache.org>
Subject [jira] [Created] (HBASE-19495) Fix failed ut TestShell
Date Tue, 12 Dec 2017 09:13:00 GMT
Guanghao Zhang created HBASE-19495:
--------------------------------------

             Summary: Fix failed ut TestShell
                 Key: HBASE-19495
                 URL: https://issues.apache.org/jira/browse/HBASE-19495
             Project: HBase
          Issue Type: Bug
            Reporter: Guanghao Zhang


Failed on master branch. Need debug.

[INFO] Running org.apache.hadoop.hbase.client.TestShell
[ERROR] Tests run: 1, Failures: 0, Errors: 1, Skipped: 0, Time elapsed: 722.737 s <<<
FAILURE! - in org.apache.hadoop.hbase.client.TestShell
[ERROR] testRunShellTests(org.apache.hadoop.hbase.client.TestShell)  Time elapsed: 699.473
s  <<< ERROR!
org.jruby.embed.EvalFailedException: (RuntimeError) Shell unit tests failed. Check output
file for details.
	at org.apache.hadoop.hbase.client.TestShell.testRunShellTests(TestShell.java:36)
Caused by: org.jruby.exceptions.RaiseException: (RuntimeError) Shell unit tests failed. Check
output file for details.




--
This message was sent by Atlassian JIRA
(v6.4.14#64029)

Mime
View raw message