hbase-dev mailing list archives

Site index · List index
Message view « Date » · « Thread »
Top « Date » · « Thread »
From "Andrew Purtell (JIRA)" <j...@apache.org>
Subject [jira] [Created] (HBASE-19490) Rare failure in TestRateLimiter
Date Tue, 12 Dec 2017 01:32:00 GMT
Andrew Purtell created HBASE-19490:
--------------------------------------

             Summary: Rare failure in TestRateLimiter
                 Key: HBASE-19490
                 URL: https://issues.apache.org/jira/browse/HBASE-19490
             Project: HBase
          Issue Type: Bug
    Affects Versions: 1.4.0
            Reporter: Andrew Purtell
             Fix For: 1.4.1, 1.5.0


Maybe we aren't waiting long enough for a slow executor? Or it is some kind of race. Test
usually passes.

[ERROR] Tests run: 15, Failures: 1, Errors: 0, Skipped: 0, Time elapsed: 1.01 s <<<
FAILURE! - in org.apache.hadoop.hbase.quotas.TestRateLimiter
[ERROR] testOverconsumptionFixedIntervalRefillStrategy(org.apache.hadoop.hbase.quotas.TestRateLimiter)
 Time elapsed: 0.028 s  <<< FAILURE!
java.lang.AssertionError: expected:<1000> but was:<999>
        at org.apache.hadoop.hbase.quotas.TestRateLimiter.testOverconsumptionFixedIntervalRefillStrategy(TestRateLimiter.java:122)



--
This message was sent by Atlassian JIRA
(v6.4.14#64029)

Mime
View raw message