hbase-dev mailing list archives

Site index · List index
Message view « Date » · « Thread »
Top « Date » · « Thread »
From "Andrew Purtell (JIRA)" <j...@apache.org>
Subject [jira] [Resolved] (HBASE-18346) TestRSKilledWhenInitializing failing on branch-1 (branch-1.4)
Date Wed, 13 Sep 2017 22:01:00 GMT

     [ https://issues.apache.org/jira/browse/HBASE-18346?page=com.atlassian.jira.plugin.system.issuetabpanels:all-tabpanel
]

Andrew Purtell resolved HBASE-18346.
------------------------------------
    Resolution: Fixed
      Assignee: Andrew Purtell

> TestRSKilledWhenInitializing failing on branch-1 (branch-1.4)
> -------------------------------------------------------------
>
>                 Key: HBASE-18346
>                 URL: https://issues.apache.org/jira/browse/HBASE-18346
>             Project: HBase
>          Issue Type: Bug
>            Reporter: Andrew Purtell
>            Assignee: Andrew Purtell
>             Fix For: 1.4.0, 1.5.0
>
>         Attachments: HBASE-18346-branch-1.patch
>
>
> Running org.apache.hadoop.hbase.regionserver.TestRSKilledWhenInitializing
> Tests run: 1, Failures: 1, Errors: 0, Skipped: 0, Time elapsed: 12.343 sec <<<
FAILURE! - in org.apache.hadoop.hbase.regionserver.TestRSKilledWhenInitiali
> zing
> testRSTerminationAfterRegisteringToMasterBeforeCreatingEphemeralNode(org.apache.hadoop.hbase.regionserver.TestRSKilledWhenInitializing)
 Time elapsed: 12.
> 329 sec  <<< FAILURE!
> java.lang.AssertionError: null
>         at org.junit.Assert.fail(Assert.java:86)
>         at org.junit.Assert.assertTrue(Assert.java:41)
>         at org.junit.Assert.assertTrue(Assert.java:52)
>         at org.apache.hadoop.hbase.regionserver.TestRSKilledWhenInitializing.testRSTerminationAfterRegisteringToMasterBeforeCreatingEphemeralNode(TestRSKi
> lledWhenInitializing.java:123)
> Tests run: 2, Failures: 0, Errors: 2, Skipped: 0, Time elapsed: 192.427 sec <<<
FAILURE! - in org.apache.hadoop.hbase.regionserver.TestRSKilledWhenInitial
> izing
> testRSTerminationAfterRegisteringToMasterBeforeCreatingEphemeralNode(org.apache.hadoop.hbase.regionserver.TestRSKilledWhenInitializing)
 Time elapsed: 179
> .859 sec  <<< ERROR!
> org.junit.runners.model.TestTimedOutException: test timed out after 180 seconds
>         at java.lang.Thread.sleep(Native Method)
>         at org.apache.hadoop.hbase.util.Threads.sleep(Threads.java:146)
>         at org.apache.hadoop.hbase.regionserver.TestRSKilledWhenInitializing.testRSTerminationAfterRegisteringToMasterBeforeCreatingEphemeralNode(TestRSKi
> lledWhenInitializing.java:113)



--
This message was sent by Atlassian JIRA
(v6.4.14#64029)

Mime
View raw message