hbase-dev mailing list archives

Site index · List index
Message view « Date » · « Thread »
Top « Date » · « Thread »
From Ted Yu <yuzhih...@gmail.com>
Subject Re: org.apache.hadoop.hbase.snapshot.TestSecureExportSnapshot broken in branch-1?
Date Wed, 26 Apr 2017 21:32:47 GMT
You can take a look at:
https://builds.apache.org/job/HBASE-Find-Flaky-Tests/lastSuccessfulBuild/artifact/dashboard.html

It seems the test is flaky.

FYI

On Wed, Apr 26, 2017 at 2:25 PM, Stephen Jiang <syuanjiangdev@gmail.com>
wrote:

> I am running "org.apache.hadoop.hbase.snapshot.TestSecureExportSnapshot"
> test in my local branch-1  today and it failed.  I just wonder anyone else
> see the same failure?
>
> -------------------------------------------------------
>  T E S T S
> -------------------------------------------------------
> Running org.apache.hadoop.hbase.snapshot.TestSecureExportSnapshot
> Tests run: 9, Failures: 7, Errors: 0, Skipped: 0, Time elapsed: 163.004 sec
> <<< FAILURE! - in org.apache.hadoop.hbase.snapshot.
> TestSecureExportSnapshot
> testExportWithTargetName(org.apache.hadoop.hbase.snapshot.
> TestSecureExportSnapshot)
>  Time elapsed: 14.708 sec  <<< FAILURE!
> java.lang.AssertionError: expected:<0> but was:<1>
> at org.junit.Assert.fail(Assert.java:88)
> at org.junit.Assert.failNotEquals(Assert.java:834)
> at org.junit.Assert.assertEquals(Assert.java:645)
> at org.junit.Assert.assertEquals(Assert.java:631)
> at
> org.apache.hadoop.hbase.snapshot.TestExportSnapshot.
> testExportFileSystemState(TestExportSnapshot.java:294)
> at
> org.apache.hadoop.hbase.snapshot.TestExportSnapshot.
> testExportFileSystemState(TestExportSnapshot.java:266)
> at
> org.apache.hadoop.hbase.snapshot.TestExportSnapshot.
> testExportWithTargetName(TestExportSnapshot.java:223)
> at sun.reflect.NativeMethodAccessorImpl.invoke0(Native Method)
> at
> sun.reflect.NativeMethodAccessorImpl.invoke(NativeMethodAccessorImpl.java:
> 62)
> at
> sun.reflect.DelegatingMethodAccessorImpl.invoke(
> DelegatingMethodAccessorImpl.java:43)
> at java.lang.reflect.Method.invoke(Method.java:498)
> at
> org.junit.runners.model.FrameworkMethod$1.runReflectiveCall(
> FrameworkMethod.java:50)
> at
> org.junit.internal.runners.model.ReflectiveCallable.run(
> ReflectiveCallable.java:12)
> at
> org.junit.runners.model.FrameworkMethod.invokeExplosively(
> FrameworkMethod.java:47)
> at
> org.junit.internal.runners.statements.InvokeMethod.
> evaluate(InvokeMethod.java:17)
> at
> org.junit.internal.runners.statements.RunBefores.
> evaluate(RunBefores.java:26)
> at
> org.junit.internal.runners.statements.RunAfters.evaluate(
> RunAfters.java:27)
> at
> org.junit.internal.runners.statements.FailOnTimeout$
> CallableStatement.call(FailOnTimeout.java:298)
> at
> org.junit.internal.runners.statements.FailOnTimeout$
> CallableStatement.call(FailOnTimeout.java:292)
> at java.util.concurrent.FutureTask.run(FutureTask.java:266)
> at java.lang.Thread.run(Thread.java:745)
>
> testExportFileSystemState(org.apache.hadoop.hbase.snapshot.
> TestSecureExportSnapshot)
>  Time elapsed: 13.045 sec  <<< FAILURE!
> java.lang.AssertionError: expected:<0> but was:<1>
> at org.junit.Assert.fail(Assert.java:88)
> at org.junit.Assert.failNotEquals(Assert.java:834)
> at org.junit.Assert.assertEquals(Assert.java:645)
> at org.junit.Assert.assertEquals(Assert.java:631)
> at
> org.apache.hadoop.hbase.snapshot.TestExportSnapshot.
> testExportFileSystemState(TestExportSnapshot.java:294)
> at
> org.apache.hadoop.hbase.snapshot.TestExportSnapshot.
> testExportFileSystemState(TestExportSnapshot.java:266)
> at
> org.apache.hadoop.hbase.snapshot.TestExportSnapshot.
> testExportFileSystemState(TestExportSnapshot.java:198)
> at sun.reflect.NativeMethodAccessorImpl.invoke0(Native Method)
> at
> sun.reflect.NativeMethodAccessorImpl.invoke(NativeMethodAccessorImpl.java:
> 62)
> at
> sun.reflect.DelegatingMethodAccessorImpl.invoke(
> DelegatingMethodAccessorImpl.java:43)
> at java.lang.reflect.Method.invoke(Method.java:498)
> at
> org.junit.runners.model.FrameworkMethod$1.runReflectiveCall(
> FrameworkMethod.java:50)
> at
> org.junit.internal.runners.model.ReflectiveCallable.run(
> ReflectiveCallable.java:12)
> at
> org.junit.runners.model.FrameworkMethod.invokeExplosively(
> FrameworkMethod.java:47)
> at
> org.junit.internal.runners.statements.InvokeMethod.
> evaluate(InvokeMethod.java:17)
> at
> org.junit.internal.runners.statements.RunBefores.
> evaluate(RunBefores.java:26)
> at
> org.junit.internal.runners.statements.RunAfters.evaluate(
> RunAfters.java:27)
> at
> org.junit.internal.runners.statements.FailOnTimeout$
> CallableStatement.call(FailOnTimeout.java:298)
> at
> org.junit.internal.runners.statements.FailOnTimeout$
> CallableStatement.call(FailOnTimeout.java:292)
> at java.util.concurrent.FutureTask.run(FutureTask.java:266)
> at java.lang.Thread.run(Thread.java:745)
>
> testConsecutiveExports(org.apache.hadoop.hbase.snapshot.
> TestSecureExportSnapshot)
>  Time elapsed: 12.967 sec  <<< FAILURE!
> java.lang.AssertionError: expected:<0> but was:<1>
> at org.junit.Assert.fail(Assert.java:88)
> at org.junit.Assert.failNotEquals(Assert.java:834)
> at org.junit.Assert.assertEquals(Assert.java:645)
> at org.junit.Assert.assertEquals(Assert.java:631)
> at
> org.apache.hadoop.hbase.snapshot.TestExportSnapshot.
> testExportFileSystemState(TestExportSnapshot.java:294)
> at
> org.apache.hadoop.hbase.snapshot.TestExportSnapshot.
> testConsecutiveExports(TestExportSnapshot.java:215)
> at sun.reflect.NativeMethodAccessorImpl.invoke0(Native Method)
> at
> sun.reflect.NativeMethodAccessorImpl.invoke(NativeMethodAccessorImpl.java:
> 62)
> at
> sun.reflect.DelegatingMethodAccessorImpl.invoke(
> DelegatingMethodAccessorImpl.java:43)
> at java.lang.reflect.Method.invoke(Method.java:498)
> at
> org.junit.runners.model.FrameworkMethod$1.runReflectiveCall(
> FrameworkMethod.java:50)
> at
> org.junit.internal.runners.model.ReflectiveCallable.run(
> ReflectiveCallable.java:12)
> at
> org.junit.runners.model.FrameworkMethod.invokeExplosively(
> FrameworkMethod.java:47)
> at
> org.junit.internal.runners.statements.InvokeMethod.
> evaluate(InvokeMethod.java:17)
> at
> org.junit.internal.runners.statements.RunBefores.
> evaluate(RunBefores.java:26)
> at
> org.junit.internal.runners.statements.RunAfters.evaluate(
> RunAfters.java:27)
> at
> org.junit.internal.runners.statements.FailOnTimeout$
> CallableStatement.call(FailOnTimeout.java:298)
> at
> org.junit.internal.runners.statements.FailOnTimeout$
> CallableStatement.call(FailOnTimeout.java:292)
> at java.util.concurrent.FutureTask.run(FutureTask.java:266)
> at java.lang.Thread.run(Thread.java:745)
>
> testEmptyExportFileSystemState(org.apache.hadoop.hbase.snapshot.
> TestSecureExportSnapshot)
>  Time elapsed: 12.913 sec  <<< FAILURE!
> java.lang.AssertionError: expected:<0> but was:<1>
> at org.junit.Assert.fail(Assert.java:88)
> at org.junit.Assert.failNotEquals(Assert.java:834)
> at org.junit.Assert.assertEquals(Assert.java:645)
> at org.junit.Assert.assertEquals(Assert.java:631)
> at
> org.apache.hadoop.hbase.snapshot.TestExportSnapshot.
> testExportFileSystemState(TestExportSnapshot.java:294)
> at
> org.apache.hadoop.hbase.snapshot.TestExportSnapshot.
> testExportFileSystemState(TestExportSnapshot.java:266)
> at
> org.apache.hadoop.hbase.snapshot.TestExportSnapshot.
> testEmptyExportFileSystemState(TestExportSnapshot.java:209)
> at sun.reflect.NativeMethodAccessorImpl.invoke0(Native Method)
> at
> sun.reflect.NativeMethodAccessorImpl.invoke(NativeMethodAccessorImpl.java:
> 62)
> at
> sun.reflect.DelegatingMethodAccessorImpl.invoke(
> DelegatingMethodAccessorImpl.java:43)
> at java.lang.reflect.Method.invoke(Method.java:498)
> at
> org.junit.runners.model.FrameworkMethod$1.runReflectiveCall(
> FrameworkMethod.java:50)
> at
> org.junit.internal.runners.model.ReflectiveCallable.run(
> ReflectiveCallable.java:12)
> at
> org.junit.runners.model.FrameworkMethod.invokeExplosively(
> FrameworkMethod.java:47)
> at
> org.junit.internal.runners.statements.InvokeMethod.
> evaluate(InvokeMethod.java:17)
> at
> org.junit.internal.runners.statements.RunBefores.
> evaluate(RunBefores.java:26)
> at
> org.junit.internal.runners.statements.RunAfters.evaluate(
> RunAfters.java:27)
> at
> org.junit.internal.runners.statements.FailOnTimeout$
> CallableStatement.call(FailOnTimeout.java:298)
> at
> org.junit.internal.runners.statements.FailOnTimeout$
> CallableStatement.call(FailOnTimeout.java:292)
> at java.util.concurrent.FutureTask.run(FutureTask.java:266)
> at java.lang.Thread.run(Thread.java:745)
>
> testSnapshotWithRefsExportFileSystemState(org.apache.hadoop.
> hbase.snapshot.TestSecureExportSnapshot)
>  Time elapsed: 13.342 sec  <<< FAILURE!
> java.lang.AssertionError: expected:<0> but was:<1>
> at org.junit.Assert.fail(Assert.java:88)
> at org.junit.Assert.failNotEquals(Assert.java:834)
> at org.junit.Assert.assertEquals(Assert.java:645)
> at org.junit.Assert.assertEquals(Assert.java:631)
> at
> org.apache.hadoop.hbase.snapshot.TestExportSnapshot.
> testExportFileSystemState(TestExportSnapshot.java:294)
> at
> org.apache.hadoop.hbase.snapshot.TestExportSnapshot.
> testExportFileSystemState(TestExportSnapshot.java:266)
> at
> org.apache.hadoop.hbase.snapshot.TestExportSnapshot.
> testSnapshotWithRefsExportFileSystemState(TestExportSnapshot.java:260)
> at
> org.apache.hadoop.hbase.snapshot.TestExportSnapshot.
> testSnapshotWithRefsExportFileSystemState(TestExportSnapshot.java:240)
> at sun.reflect.NativeMethodAccessorImpl.invoke0(Native Method)
> at
> sun.reflect.NativeMethodAccessorImpl.invoke(NativeMethodAccessorImpl.java:
> 62)
> at
> sun.reflect.DelegatingMethodAccessorImpl.invoke(
> DelegatingMethodAccessorImpl.java:43)
> at java.lang.reflect.Method.invoke(Method.java:498)
> at
> org.junit.runners.model.FrameworkMethod$1.runReflectiveCall(
> FrameworkMethod.java:50)
> at
> org.junit.internal.runners.model.ReflectiveCallable.run(
> ReflectiveCallable.java:12)
> at
> org.junit.runners.model.FrameworkMethod.invokeExplosively(
> FrameworkMethod.java:47)
> at
> org.junit.internal.runners.statements.InvokeMethod.
> evaluate(InvokeMethod.java:17)
> at
> org.junit.internal.runners.statements.RunBefores.
> evaluate(RunBefores.java:26)
> at
> org.junit.internal.runners.statements.RunAfters.evaluate(
> RunAfters.java:27)
> at
> org.junit.internal.runners.statements.FailOnTimeout$
> CallableStatement.call(FailOnTimeout.java:298)
> at
> org.junit.internal.runners.statements.FailOnTimeout$
> CallableStatement.call(FailOnTimeout.java:292)
> at java.util.concurrent.FutureTask.run(FutureTask.java:266)
> at java.lang.Thread.run(Thread.java:745)
>
> testExportFileSystemStateWithSkipTmp(org.apache.hadoop.hbase.snapshot.
> TestSecureExportSnapshot)
>  Time elapsed: 12.136 sec  <<< FAILURE!
> java.lang.AssertionError: expected:<0> but was:<1>
> at org.junit.Assert.fail(Assert.java:88)
> at org.junit.Assert.failNotEquals(Assert.java:834)
> at org.junit.Assert.assertEquals(Assert.java:645)
> at org.junit.Assert.assertEquals(Assert.java:631)
> at
> org.apache.hadoop.hbase.snapshot.TestExportSnapshot.
> testExportFileSystemState(TestExportSnapshot.java:294)
> at
> org.apache.hadoop.hbase.snapshot.TestExportSnapshot.
> testExportFileSystemState(TestExportSnapshot.java:266)
> at
> org.apache.hadoop.hbase.snapshot.TestExportSnapshot.
> testExportFileSystemStateWithSkipTmp(TestExportSnapshot.java:204)
> at sun.reflect.NativeMethodAccessorImpl.invoke0(Native Method)
> at
> sun.reflect.NativeMethodAccessorImpl.invoke(NativeMethodAccessorImpl.java:
> 62)
> at
> sun.reflect.DelegatingMethodAccessorImpl.invoke(
> DelegatingMethodAccessorImpl.java:43)
> at java.lang.reflect.Method.invoke(Method.java:498)
> at
> org.junit.runners.model.FrameworkMethod$1.runReflectiveCall(
> FrameworkMethod.java:50)
> at
> org.junit.internal.runners.model.ReflectiveCallable.run(
> ReflectiveCallable.java:12)
> at
> org.junit.runners.model.FrameworkMethod.invokeExplosively(
> FrameworkMethod.java:47)
> at
> org.junit.internal.runners.statements.InvokeMethod.
> evaluate(InvokeMethod.java:17)
> at
> org.junit.internal.runners.statements.RunBefores.
> evaluate(RunBefores.java:26)
> at
> org.junit.internal.runners.statements.RunAfters.evaluate(
> RunAfters.java:27)
> at
> org.junit.internal.runners.statements.FailOnTimeout$
> CallableStatement.call(FailOnTimeout.java:298)
> at
> org.junit.internal.runners.statements.FailOnTimeout$
> CallableStatement.call(FailOnTimeout.java:292)
> at java.util.concurrent.FutureTask.run(FutureTask.java:266)
> at java.lang.Thread.run(Thread.java:745)
>
> testExportRetry(org.apache.hadoop.hbase.snapshot.TestSecureExportSnapshot)
>  Time elapsed: 12.903 sec  <<< FAILURE!
> java.lang.AssertionError: expected:<0> but was:<1>
> at org.junit.Assert.fail(Assert.java:88)
> at org.junit.Assert.failNotEquals(Assert.java:834)
> at org.junit.Assert.assertEquals(Assert.java:645)
> at org.junit.Assert.assertEquals(Assert.java:631)
> at
> org.apache.hadoop.hbase.snapshot.TestExportSnapshot.testExportRetry(
> TestExportSnapshot.java:329)
> at sun.reflect.NativeMethodAccessorImpl.invoke0(Native Method)
> at
> sun.reflect.NativeMethodAccessorImpl.invoke(NativeMethodAccessorImpl.java:
> 62)
> at
> sun.reflect.DelegatingMethodAccessorImpl.invoke(
> DelegatingMethodAccessorImpl.java:43)
> at java.lang.reflect.Method.invoke(Method.java:498)
> at
> org.junit.runners.model.FrameworkMethod$1.runReflectiveCall(
> FrameworkMethod.java:50)
> at
> org.junit.internal.runners.model.ReflectiveCallable.run(
> ReflectiveCallable.java:12)
> at
> org.junit.runners.model.FrameworkMethod.invokeExplosively(
> FrameworkMethod.java:47)
> at
> org.junit.internal.runners.statements.InvokeMethod.
> evaluate(InvokeMethod.java:17)
> at
> org.junit.internal.runners.statements.RunBefores.
> evaluate(RunBefores.java:26)
> at
> org.junit.internal.runners.statements.RunAfters.evaluate(
> RunAfters.java:27)
> at
> org.junit.internal.runners.statements.FailOnTimeout$
> CallableStatement.call(FailOnTimeout.java:298)
> at
> org.junit.internal.runners.statements.FailOnTimeout$
> CallableStatement.call(FailOnTimeout.java:292)
> at java.util.concurrent.FutureTask.run(FutureTask.java:266)
> at java.lang.Thread.run(Thread.java:745)
>
>
> Results :
>
> Failed tests:
>
> TestSecureExportSnapshot>TestExportSnapshot.testConsecutiveExports:215->
> TestExportSnapshot.testExportFileSystemState:294
> expected:<0> but was:<1>
>
> TestSecureExportSnapshot>TestExportSnapshot.testEmptyExportFileSystemState
> :209->TestExportSnapshot.testExportFileSystemState:266-
> >TestExportSnapshot.testExportFileSystemState:294
> expected:<0> but was:<1>
>
> TestSecureExportSnapshot>TestExportSnapshot.testExportFileSystemState:198-
> >TestExportSnapshot.testExportFileSystemState:266->TestExportSnapshot.
> testExportFileSystemState:294
> expected:<0> but was:<1>
>
> TestSecureExportSnapshot>TestExportSnapshot.testExportFileSystemStateWithS
> kipTmp:204->TestExportSnapshot.testExportFileSystemState:266-
> >TestExportSnapshot.testExportFileSystemState:294
> expected:<0> but was:<1>
>   TestSecureExportSnapshot>TestExportSnapshot.testExportRetry:329
> expected:<0> but was:<1>
>
> TestSecureExportSnapshot>TestExportSnapshot.testExportWithTargetName:223->
> TestExportSnapshot.testExportFileSystemState:266->TestExportSnapshot.
> testExportFileSystemState:294
> expected:<0> but was:<1>
>
> TestSecureExportSnapshot>TestExportSnapshot.testSnapshotWithRefsExportFile
> SystemState:240->TestExportSnapshot.testSnapshotWithRefsExportFile
> SystemState:260->TestExportSnapshot.testExportFileSystemState:266-
> >TestExportSnapshot.testExportFileSystemState:294
> expected:<0> but was:<1>
>
> Tests run: 9, Failures: 7, Errors: 0, Skipped: 0
>

Mime
  • Unnamed multipart/alternative (inline, None, 0 bytes)
View raw message