hbase-dev mailing list archives

Site index · List index
Message view « Date » · « Thread »
Top « Date » · « Thread »
From "Yesha Vora (JIRA)" <j...@apache.org>
Subject [jira] [Created] (HBASE-17692) testSameVersionUpdatesRecoveryWithCompaction fails with NPE
Date Fri, 24 Feb 2017 16:49:44 GMT
Yesha Vora created HBASE-17692:
----------------------------------

             Summary: testSameVersionUpdatesRecoveryWithCompaction fails with NPE
                 Key: HBASE-17692
                 URL: https://issues.apache.org/jira/browse/HBASE-17692
             Project: HBase
          Issue Type: Bug
            Reporter: Yesha Vora


testSameVersionUpdatesRecoveryWithCompaction test fails with NPE as below.
{code:title=cmd}mvn -B -nsu test -Dtest=TestOpenedRegionHandler,TestMasterFileSystemWithWALDir,TestDistributedLogSplitting,TestRegionPlacement,TestGetLastFlushedSequenceId,TestZKLessAMOnCluster,TestMasterRestartAfterDisablingTable,TestSplitLogManager,TestSimpleRegionNormalizerOnCluster,TestHFileLinkCleaner,TestSnapshotFromMaster,TestLogsCleaner,TestModifyColumnFamilyProcedure,TestCreateTableProcedure2,TestTruncateTableProcedure,TestWALProcedureStoreOnHDFS,TestProcedureAdmin,TestAddColumnFamilyProcedure,TestDisableTableProcedure,TestCreateTableProcedure,TestDeleteTableProcedure,TestEnableTableProcedure,TestMasterProcedureQueue,TestDeleteColumnFamilyProcedure,TestModifyTableProcedure,TestMasterFailoverWithProcedures,TestSnapshotFileCache,TestTableDeleteFamilyHandler,TestCreateTableHandler,TestTableDescriptorModification,TestEnableTableHandler,TestStochasticLoadBalancer,TestFavoredNodeAssignmentHelper,TestStochasticLoadBalancer2,TestConstraint,TestFilterList,TestParseFilter,TestSingleColumnValueFilter,TestMultipleColumnPrefixFilter,TestColumnPrefixFilter,TestColumnPaginationFilter,TestPrefixFilter,TestScanRowPrefix,TestNullComparator,TestRegexComparator,TestPageFilter,TestDependentColumnFilter,TestFuzzyRowAndColumnRangeFilter,TestFuzzyRowFilterEndToEnd,TestFilterSerialization,TestFilterWrapper,TestComparatorSerialization,TestRandomRowFilter,TestSingleColumnValueExcludeFilter,TestColumnRangeFilter,TestFilter,TestFuzzyRowFilter,TestFirstKeyValueMatchingQualifiersFilter,TestMultiRowRangeFilter,TestPutDeleteEtcCellIteration,TestResultSizeEstimation,TestTimestampsFilter,TestUpdateConfiguration,TestClientTimeouts,TestResult,TestClientPushback,TestConnectionUtils
--projects :hbase-server{code}

{code}
Running org.apache.hadoop.hbase.filter.TestFirstKeyValueMatchingQualifiersFilter
Tests run: 1, Failures: 0, Errors: 0, Skipped: 0, Time elapsed: 0.4 sec - in org.apache.hadoop.hbase.filter.TestFirstKeyValueMatchingQualifiersFilter
Running org.apache.hadoop.hbase.filter.TestDependentColumnFilter
Tests run: 4, Failures: 0, Errors: 0, Skipped: 0, Time elapsed: 2.487 sec - in org.apache.hadoop.hbase.filter.TestDependentColumnFilter

Results :


Tests in error: 
  TestDistributedLogSplitting.testSameVersionUpdatesRecoveryWithCompaction:1377 ยป NullPointer


Tests run: 384, Failures: 0, Errors: 1, Skipped: 3

[INFO] ------------------------------------------------------------------------
[INFO] BUILD FAILURE
[INFO] ------------------------------------------------------------------------
[INFO] Total time: 59:21 min
[INFO] Finished at: 2017-02-23T21:57:52+00:00
[INFO] Final Memory: 51M/898M
[INFO] ------------------------------------------------------------------------
[ERROR] Failed to execute goal org.apache.maven.plugins:maven-surefire-plugin:2.18:test (default-test)
on project hbase-server: There are test failures.
[ERROR] 
[ERROR] Please refer to /grid/0/nobody/workspace/build-support/SOURCES/hbase/hbase-server/target/surefire-reports
for the individual test results.
[ERROR] -> [Help 1]
[ERROR] 
[ERROR] To see the full stack trace of the errors, re-run Maven with the -e switch.
[ERROR] Re-run Maven using the -X switch to enable full debug logging.
[ERROR] 
[ERROR] For more information about the errors and possible solutions, please read the following
articles:
[ERROR] [Help 1] http://cwiki.apache.org/confluence/display/MAVEN/MojoFailureException{code}



--
This message was sent by Atlassian JIRA
(v6.3.15#6346)

Mime
View raw message