hbase-dev mailing list archives

Site index · List index
Message view « Date » · « Thread »
Top « Date » · « Thread »
From "Saravanan Krishnamoorthy (JIRA)" <j...@apache.org>
Subject [jira] [Created] (HBASE-16750) hbase compilation failed
Date Mon, 03 Oct 2016 18:28:20 GMT
Saravanan Krishnamoorthy created HBASE-16750:
------------------------------------------------

             Summary: hbase compilation failed
                 Key: HBASE-16750
                 URL: https://issues.apache.org/jira/browse/HBASE-16750
             Project: HBase
          Issue Type: Bug
          Components: hbase
    Affects Versions: 1.1.2
            Reporter: Saravanan Krishnamoorthy
             Fix For: 1.1.2


Hi,

hbase compilation failed on IBM power system ppc64le architecture with below error:

{code}
Hbase Failure:
[INFO] ------------------------------------------------------------------------
[INFO] BUILD FAILURE
[INFO] ------------------------------------------------------------------------
[INFO] Total time: 04:33 min
[INFO] Finished at: 2016-09-30T08:58:47-04:00
[INFO] Final Memory: 215M/843M
[INFO] ------------------------------------------------------------------------
[ERROR] Failed to execute goal org.asciidoctor:asciidoctor-maven-plugin:1.5.2.1:process-asciidoc
(output-pdf) on project hbase: Execution output-pdf of goal org.asciidoctor:asciidoctor-maven-plugin:1.5.2.1:process-asciidoc
failed: (NotImplementedError) fstat unimplemented unsupported or native support failed to
load -> [Help 1]
org.apache.maven.lifecycle.LifecycleExecutionException: Failed to execute goal org.asciidoctor:asciidoctor-maven-plugin:1.5.2.1:process-asciidoc
(output-pdf) on project hbase: Execution output-pdf of goal org.asciidoctor:asciidoctor-maven-plugin:1.5.2.1:process-asciidoc
failed: (NotImplementedError) fstat unimplemented unsupported or native support failed to
load
	at org.apache.maven.lifecycle.internal.MojoExecutor.execute(MojoExecutor.java:212)
	at org.apache.maven.lifecycle.internal.MojoExecutor.execute(MojoExecutor.java:153)
	at org.apache.maven.lifecycle.internal.MojoExecutor.execute(MojoExecutor.java:145)
	at org.apache.maven.lifecycle.internal.LifecycleModuleBuilder.buildProject(LifecycleModuleBuilder.java:116)
	at org.apache.maven.lifecycle.internal.LifecycleModuleBuilder.buildProject(LifecycleModuleBuilder.java:80)
	at org.apache.maven.lifecycle.internal.builder.singlethreaded.SingleThreadedBuilder.build(SingleThreadedBuilder.java:51)
	at org.apache.maven.lifecycle.internal.LifecycleStarter.execute(LifecycleStarter.java:128)
	at org.apache.maven.DefaultMaven.doExecute(DefaultMaven.java:307)
	at org.apache.maven.DefaultMaven.doExecute(DefaultMaven.java:193)
	at org.apache.maven.DefaultMaven.execute(DefaultMaven.java:106)
	at org.apache.maven.cli.MavenCli.execute(MavenCli.java:863)
	at org.apache.maven.cli.MavenCli.doMain(MavenCli.java:288)
	at org.apache.maven.cli.MavenCli.main(MavenCli.java:199)
	at sun.reflect.NativeMethodAccessorImpl.invoke0(Native Method)
	at sun.reflect.NativeMethodAccessorImpl.invoke(NativeMethodAccessorImpl.java:57)
	at sun.reflect.DelegatingMethodAccessorImpl.invoke(DelegatingMethodAccessorImpl.java:43)
	at java.lang.reflect.Method.invoke(Method.java:606)
	at org.codehaus.plexus.classworlds.launcher.Launcher.launchEnhanced(Launcher.java:289)
	at org.codehaus.plexus.classworlds.launcher.Launcher.launch(Launcher.java:229)
	at org.codehaus.plexus.classworlds.launcher.Launcher.mainWithExitCode(Launcher.java:415)
	at org.codehaus.plexus.classworlds.launcher.Launcher.main(Launcher.java:356)
Caused by: org.apache.maven.plugin.PluginExecutionException: Execution output-pdf of goal
org.asciidoctor:asciidoctor-maven-plugin:1.5.2.1:process-asciidoc failed: (NotImplementedError)
fstat unimplemented unsupported or native support failed to load
	at org.apache.maven.plugin.DefaultBuildPluginManager.executeMojo(DefaultBuildPluginManager.java:145)
	at org.apache.maven.lifecycle.internal.MojoExecutor.execute(MojoExecutor.java:207)
	... 20 more
Caused by: org.jruby.exceptions.RaiseException: (NotImplementedError) fstat unimplemented
unsupported or native support failed to load
	at org.jruby.RubyFile.size(org/jruby/RubyFile.java:1108)
	at RUBY.render_body(/grid/0/jenkins/.m2/repository/org/asciidoctor/asciidoctorj-pdf/1.5.0-alpha.6/asciidoctorj-pdf-1.5.0-alpha.6.jar!/gems/pdf-core-0.2.5/lib/pdf/core/document_state.rb:69)
	at RUBY.each(/grid/0/jenkins/.m2/repository/org/asciidoctor/asciidoctorj-pdf/1.5.0-alpha.6/asciidoctorj-pdf-1.5.0-alpha.6.jar!/gems/pdf-core-0.2.5/lib/pdf/core/object_store.rb:70)
	at org.jruby.RubyArray.each(org/jruby/RubyArray.java:1613)
	at RUBY.each(/grid/0/jenkins/.m2/repository/org/asciidoctor/asciidoctorj-pdf/1.5.0-alpha.6/asciidoctorj-pdf-1.5.0-alpha.6.jar!/gems/pdf-core-0.2.5/lib/pdf/core/object_store.rb:69)
	at RUBY.render_body(/grid/0/jenkins/.m2/repository/org/asciidoctor/asciidoctorj-pdf/1.5.0-alpha.6/asciidoctorj-pdf-1.5.0-alpha.6.jar!/gems/pdf-core-0.2.5/lib/pdf/core/document_state.rb:68)
	at RUBY.render_body(/grid/0/jenkins/.m2/repository/org/asciidoctor/asciidoctorj-pdf/1.5.0-alpha.6/asciidoctorj-pdf-1.5.0-alpha.6.jar!/gems/prawn-1.2.1/lib/prawn/document/internals.rb:141)
	at RUBY.render(/grid/0/jenkins/.m2/repository/org/asciidoctor/asciidoctorj-pdf/1.5.0-alpha.6/asciidoctorj-pdf-1.5.0-alpha.6.jar!/gems/prawn-1.2.1/lib/prawn/document.rb:359)
	at RUBY.render_file(/grid/0/jenkins/.m2/repository/org/asciidoctor/asciidoctorj-pdf/1.5.0-alpha.6/asciidoctorj-pdf-1.5.0-alpha.6.jar!/gems/prawn-1.2.1/lib/prawn/document.rb:376)
	at org.jruby.RubyIO.open(org/jruby/RubyIO.java:1181)
	at RUBY.render_file(/grid/0/jenkins/.m2/repository/org/asciidoctor/asciidoctorj-pdf/1.5.0-alpha.6/asciidoctorj-pdf-1.5.0-alpha.6.jar!/gems/prawn-1.2.1/lib/prawn/document.rb:376)
	at RUBY.write(/grid/0/jenkins/.m2/repository/org/asciidoctor/asciidoctorj-pdf/1.5.0-alpha.6/asciidoctorj-pdf-1.5.0-alpha.6.jar!/gems/asciidoctor-pdf-1.5.0.alpha.6/lib/asciidoctor-pdf/converter.rb:1235)
	at RUBY.write(/grid/0/jenkins/.m2/repository/org/asciidoctor/asciidoctorj/1.5.2/asciidoctorj-1.5.2.jar!/gems/asciidoctor-1.5.2/lib/asciidoctor/document.rb:1051)
	at RUBY.convert(/grid/0/jenkins/.m2/repository/org/asciidoctor/asciidoctorj/1.5.2/asciidoctorj-1.5.2.jar!/gems/asciidoctor-1.5.2/lib/asciidoctor.rb:1504)
	at RUBY.convert_file(/grid/0/jenkins/.m2/repository/org/asciidoctor/asciidoctorj/1.5.2/asciidoctorj-1.5.2.jar!/gems/asciidoctor-1.5.2/lib/asciidoctor.rb:1562)
	at RUBY.convertFile(<script>:68)
	at org.jruby.gen.InterfaceImpl537412764.convertFile(org/jruby/gen/InterfaceImpl537412764.gen:13)
[ERROR]
[ERROR]
[ERROR] For more information about the errors and possible solutions, please read the following
articles:
[ERROR] [Help 1] http://cwiki.apache.org/confluence/display/MAVEN/PluginExecutionException
{code}

As per this recommendation if we update asciidoctor version it fixes the problem
{code}
https://github.com/asciidoctor/asciidoctorj/issues/402
{code}

Please find the patch attached.



--
This message was sent by Atlassian JIRA
(v6.3.4#6332)

Mime
View raw message