hbase-dev mailing list archives

Site index · List index
Message view « Date » · « Thread »
Top « Date » · « Thread »
From "Mikhail Antonov (JIRA)" <j...@apache.org>
Subject [jira] [Created] (HBASE-16051) TestScannerHeartbeatMessages fails on some machines
Date Thu, 16 Jun 2016 23:17:05 GMT
Mikhail Antonov created HBASE-16051:
---------------------------------------

             Summary: TestScannerHeartbeatMessages fails on some machines
                 Key: HBASE-16051
                 URL: https://issues.apache.org/jira/browse/HBASE-16051
             Project: HBase
          Issue Type: Bug
          Components: test
    Affects Versions: 1.3.0
            Reporter: Mikhail Antonov


I can see below on my Linux box (reproduces consistently). It passes on OSX laptop.

 T E S T S
-------------------------------------------------------
Java HotSpot(TM) 64-Bit Server VM warning: ignoring option MaxPermSize=256m; support was removed
in 8.0
Running org.apache.hadoop.hbase.regionserver.TestScannerHeartbeatMessages
Tests run: 1, Failures: 1, Errors: 0, Skipped: 0, Time elapsed: 27.907 sec <<< FAILURE!
- in org.apache.hadoop.hbase.regionserver.TestScannerHeartbeatMessages
testScannerHeartbeatMessages(org.apache.hadoop.hbase.regionserver.TestScannerHeartbeatMessages)
 Time elapsed: 12.95 sec  <<< FAILURE!
java.lang.AssertionError: Heartbeats messages are disabled, an exception should be thrown.
If an exception  is not thrown, the test case is not testing the importance of heartbeat messages
        at org.junit.Assert.fail(Assert.java:88)
        at org.apache.hadoop.hbase.regionserver.TestScannerHeartbeatMessages.testImportanceOfHeartbeats(TestScannerHeartbeatMessages.java:233)
        at org.apache.hadoop.hbase.regionserver.TestScannerHeartbeatMessages.testScannerHeartbeatMessages(TestScannerHeartbeatMessages.java:204)


Results :

Failed tests:
  TestScannerHeartbeatMessages.testScannerHeartbeatMessages:204->testImportanceOfHeartbeats:233
Heartbeats messages are disabled, an exception should be thrown. If an exception  is not thrown,
the test case is not testing the importance of heartbeat messages

Tests run: 1, Failures: 1, Errors: 0, Skipped: 0



--
This message was sent by Atlassian JIRA
(v6.3.4#6332)

Mime
View raw message