hbase-dev mailing list archives

Site index · List index
Message view « Date » · « Thread »
Top « Date » · « Thread »
From Stack <st...@duboce.net>
Subject Re: Build failed in Jenkins: HBase-Trunk_matrix » latest1.8,yahoo-not-h2 #840
Date Tue, 12 Apr 2016 15:55:36 GMT
https://builds.apache.org/job/HBase-Trunk_matrix/jdk=latest1.8,label=yahoo-not-h2/840/consoleText


kalashnikov:hbase.git stack$ python ./dev-support/findHangingTests.py
https://builds.apache.org/job/HBase-Trunk_matrix/jdk=latest1.8,label=yahoo-not-h2/840/consoleText
Fetching
https://builds.apache.org/job/HBase-Trunk_matrix/jdk=latest1.8,label=yahoo-not-h2/840/consoleText
Building remotely on ubuntu-4 (docker Ubuntu ubuntu4 ubuntu yahoo-not-h2)
in workspace
/home/jenkins/jenkins-slave/workspace/HBase-Trunk_matrix/jdk/latest1.8/label/yahoo-not-h2
Printing hanging tests
Hanging test : org.apache.hadoop.hbase.snapshot.TestFlushSnapshotFromClient
Printing Failing tests


St.Ack

On Mon, Apr 11, 2016 at 9:36 PM, Apache Jenkins Server <
jenkins@builds.apache.org> wrote:

> See <
> https://builds.apache.org/job/HBase-Trunk_matrix/jdk=latest1.8,label=yahoo-not-h2/840/changes
> >
>
> Changes:
>
> [tedyu] HBASE-14985 TimeRange constructors should set allTime when
> appropriate
>
> ------------------------------------------
> [...truncated 7045 lines...]
> Tests run: 3, Failures: 0, Errors: 0, Skipped: 0, Time elapsed: 46.74 sec
> - in org.apache.hadoop.hbase.master.procedure.TestWALProcedureStoreOnHDFS
> Java HotSpot(TM) 64-Bit Server VM warning: ignoring option
> MaxPermSize=256m; support was removed in 8.0
> Running org.apache.hadoop.hbase.master.TestMasterFailover
> Tests run: 6, Failures: 0, Errors: 0, Skipped: 0, Time elapsed: 34.127 sec
> - in org.apache.hadoop.hbase.master.procedure.TestTruncateTableProcedure
> Java HotSpot(TM) 64-Bit Server VM warning: ignoring option
> MaxPermSize=256m; support was removed in 8.0
> Tests run: 1, Failures: 0, Errors: 0, Skipped: 0, Time elapsed: 26.268 sec
> - in org.apache.hadoop.hbase.master.TestMasterFailoverBalancerPersistence
> Java HotSpot(TM) 64-Bit Server VM warning: ignoring option
> MaxPermSize=256m; support was removed in 8.0
> Running org.apache.hadoop.hbase.master.TestMetaShutdownHandler
> Tests run: 5, Failures: 0, Errors: 0, Skipped: 0, Time elapsed: 86.935 sec
> - in org.apache.hadoop.hbase.master.procedure.TestRestoreSnapshotProcedure
> Java HotSpot(TM) 64-Bit Server VM warning: ignoring option
> MaxPermSize=256m; support was removed in 8.0
> Running org.apache.hadoop.hbase.master.TestAssignmentManagerOnCluster
> Running org.apache.hadoop.hbase.master.TestTableStateManager
> Tests run: 3, Failures: 0, Errors: 0, Skipped: 0, Time elapsed: 54.888 sec
> - in org.apache.hadoop.hbase.master.TestMasterFailover
> Java HotSpot(TM) 64-Bit Server VM warning: ignoring option
> MaxPermSize=256m; support was removed in 8.0
> Running org.apache.hadoop.hbase.master.TestMasterShutdown
> Tests run: 1, Failures: 0, Errors: 0, Skipped: 0, Time elapsed: 25.277 sec
> - in org.apache.hadoop.hbase.master.TestTableStateManager
> Java HotSpot(TM) 64-Bit Server VM warning: ignoring option
> MaxPermSize=256m; support was removed in 8.0
> Tests run: 1, Failures: 0, Errors: 0, Skipped: 0, Time elapsed: 32.819 sec
> - in org.apache.hadoop.hbase.master.TestMetaShutdownHandler
> Java HotSpot(TM) 64-Bit Server VM warning: ignoring option
> MaxPermSize=256m; support was removed in 8.0
> Running org.apache.hadoop.hbase.master.TestMasterNoCluster
> Tests run: 8, Failures: 0, Errors: 0, Skipped: 0, Time elapsed: 127.858
> sec - in
> org.apache.hadoop.hbase.master.procedure.TestMasterFailoverWithProcedures
> Java HotSpot(TM) 64-Bit Server VM warning: ignoring option
> MaxPermSize=256m; support was removed in 8.0
> Java HotSpot(TM) 64-Bit Server VM warning: ignoring option
> MaxPermSize=256m; support was removed in 8.0
> Running org.apache.hadoop.hbase.master.TestMasterFileSystem
> Tests run: 2, Failures: 0, Errors: 0, Skipped: 0, Time elapsed: 26.469 sec
> - in org.apache.hadoop.hbase.master.TestMasterShutdown
> Running org.apache.hadoop.hbase.master.balancer.TestStochasticLoadBalancer
> Java HotSpot(TM) 64-Bit Server VM warning: ignoring option
> MaxPermSize=256m; support was removed in 8.0
> Java HotSpot(TM) 64-Bit Server VM warning: ignoring option
> MaxPermSize=256m; support was removed in 8.0
> Tests run: 2, Failures: 0, Errors: 0, Skipped: 0, Time elapsed: 2.382 sec
> - in org.apache.hadoop.hbase.master.TestMasterFileSystem
> Java HotSpot(TM) 64-Bit Server VM warning: ignoring option
> MaxPermSize=256m; support was removed in 8.0
> Tests run: 3, Failures: 0, Errors: 0, Skipped: 0, Time elapsed: 18.747 sec
> - in org.apache.hadoop.hbase.master.TestMasterNoCluster
> Running org.apache.hadoop.hbase.master.balancer.TestDefaultLoadBalancer
> Java HotSpot(TM) 64-Bit Server VM warning: ignoring option
> MaxPermSize=256m; support was removed in 8.0
> Java HotSpot(TM) 64-Bit Server VM warning: ignoring option
> MaxPermSize=256m; support was removed in 8.0
> Running org.apache.hadoop.hbase.master.balancer.TestStochasticLoadBalancer2
> Tests run: 1, Failures: 0, Errors: 0, Skipped: 0, Time elapsed: 4.703 sec
> - in org.apache.hadoop.hbase.master.balancer.TestDefaultLoadBalancer
> Java HotSpot(TM) 64-Bit Server VM warning: ignoring option
> MaxPermSize=256m; support was removed in 8.0
> Running org.apache.hadoop.hbase.master.balancer.TestBaseLoadBalancer
> Java HotSpot(TM) 64-Bit Server VM warning: ignoring option
> MaxPermSize=256m; support was removed in 8.0
> Tests run: 6, Failures: 0, Errors: 0, Skipped: 0, Time elapsed: 0.844 sec
> - in org.apache.hadoop.hbase.master.balancer.TestBaseLoadBalancer
> Java HotSpot(TM) 64-Bit Server VM warning: ignoring option
> MaxPermSize=256m; support was removed in 8.0
> Running org.apache.hadoop.hbase.master.TestActiveMasterManager
> Tests run: 2, Failures: 0, Errors: 0, Skipped: 0, Time elapsed: 2.003 sec
> - in org.apache.hadoop.hbase.master.TestActiveMasterManager
> Java HotSpot(TM) 64-Bit Server VM warning: ignoring option
> MaxPermSize=256m; support was removed in 8.0
> Running org.apache.hadoop.hbase.master.TestRestartCluster
> Running org.apache.hadoop.hbase.master.TestRegionPlacement2
> Tests run: 2, Failures: 0, Errors: 0, Skipped: 0, Time elapsed: 2.823 sec
> - in org.apache.hadoop.hbase.master.TestRegionPlacement2
> Java HotSpot(TM) 64-Bit Server VM warning: ignoring option
> MaxPermSize=256m; support was removed in 8.0
> Running org.apache.hadoop.hbase.master.TestMasterTransitions
> Tests run: 3, Failures: 0, Errors: 0, Skipped: 3, Time elapsed: 0.004 sec
> - in org.apache.hadoop.hbase.master.TestMasterTransitions
> Java HotSpot(TM) 64-Bit Server VM warning: ignoring option
> MaxPermSize=256m; support was removed in 8.0
> Running org.apache.hadoop.hbase.master.TestTableLockManager
> Tests run: 22, Failures: 0, Errors: 0, Skipped: 0, Time elapsed: 118.669
> sec - in org.apache.hadoop.hbase.master.TestAssignmentManagerOnCluster
> Java HotSpot(TM) 64-Bit Server VM warning: ignoring option
> MaxPermSize=256m; support was removed in 8.0
> Tests run: 2, Failures: 0, Errors: 0, Skipped: 0, Time elapsed: 61.319 sec
> - in org.apache.hadoop.hbase.master.TestRestartCluster
> Java HotSpot(TM) 64-Bit Server VM warning: ignoring option
> MaxPermSize=256m; support was removed in 8.0
> Running
> org.apache.hadoop.hbase.master.handler.TestTableDescriptorModification
> Running org.apache.hadoop.hbase.master.handler.TestTableDeleteFamilyHandler
> Tests run: 2, Failures: 0, Errors: 0, Skipped: 0, Time elapsed: 19.547 sec
> - in org.apache.hadoop.hbase.master.handler.TestTableDeleteFamilyHandler
> Java HotSpot(TM) 64-Bit Server VM warning: ignoring option
> MaxPermSize=256m; support was removed in 8.0
> Running org.apache.hadoop.hbase.master.handler.TestEnableTableHandler
> Tests run: 7, Failures: 0, Errors: 0, Skipped: 0, Time elapsed: 37.658 sec
> - in org.apache.hadoop.hbase.master.handler.TestTableDescriptorModification
> Java HotSpot(TM) 64-Bit Server VM warning: ignoring option
> MaxPermSize=256m; support was removed in 8.0
> Running org.apache.hadoop.hbase.master.TestGetLastFlushedSequenceId
> Tests run: 1, Failures: 0, Errors: 0, Skipped: 0, Time elapsed: 25.332 sec
> - in org.apache.hadoop.hbase.master.TestGetLastFlushedSequenceId
> Java HotSpot(TM) 64-Bit Server VM warning: ignoring option
> MaxPermSize=256m; support was removed in 8.0
> Tests run: 4, Failures: 0, Errors: 0, Skipped: 0, Time elapsed: 116.497
> sec - in org.apache.hadoop.hbase.master.TestTableLockManager
> Java HotSpot(TM) 64-Bit Server VM warning: ignoring option
> MaxPermSize=256m; support was removed in 8.0
> Running org.apache.hadoop.hbase.master.TestRollingRestart
> Java HotSpot(TM) 64-Bit Server VM warning: ignoring option
> MaxPermSize=256m; support was removed in 8.0
> Running org.apache.hadoop.hbase.master.TestHMasterRPCException
> Tests run: 2, Failures: 0, Errors: 0, Skipped: 0, Time elapsed: 44.026 sec
> - in org.apache.hadoop.hbase.master.handler.TestEnableTableHandler
> Java HotSpot(TM) 64-Bit Server VM warning: ignoring option
> MaxPermSize=256m; support was removed in 8.0
> Tests run: 1, Failures: 0, Errors: 0, Skipped: 0, Time elapsed: 6.04 sec -
> in org.apache.hadoop.hbase.master.TestHMasterRPCException
> Running org.apache.hadoop.hbase.master.TestSplitLogManager
> Java HotSpot(TM) 64-Bit Server VM warning: ignoring option
> MaxPermSize=256m; support was removed in 8.0
> Running org.apache.hadoop.hbase.master.TestMaster
> Tests run: 1, Failures: 0, Errors: 0, Skipped: 0, Time elapsed: 47.128 sec
> - in org.apache.hadoop.hbase.master.TestRollingRestart
> Java HotSpot(TM) 64-Bit Server VM warning: ignoring option
> MaxPermSize=256m; support was removed in 8.0
> Running org.apache.hadoop.hbase.master.TestClusterStatusPublisher
> Tests run: 4, Failures: 0, Errors: 0, Skipped: 0, Time elapsed: 15.194 sec
> - in org.apache.hadoop.hbase.master.TestMaster
> Tests run: 3, Failures: 0, Errors: 0, Skipped: 0, Time elapsed: 0.613 sec
> - in org.apache.hadoop.hbase.master.TestClusterStatusPublisher
> Java HotSpot(TM) 64-Bit Server VM warning: ignoring option
> MaxPermSize=256m; support was removed in 8.0
> Java HotSpot(TM) 64-Bit Server VM warning: ignoring option
> MaxPermSize=256m; support was removed in 8.0
> Running org.apache.hadoop.hbase.master.TestGetInfoPort
> Running org.apache.hadoop.hbase.master.TestDeadServer
> Tests run: 1, Failures: 0, Errors: 0, Skipped: 0, Time elapsed: 21.437 sec
> - in org.apache.hadoop.hbase.master.TestGetInfoPort
> Tests run: 4, Failures: 0, Errors: 0, Skipped: 0, Time elapsed: 2.45 sec -
> in org.apache.hadoop.hbase.master.TestDeadServer
> Java HotSpot(TM) 64-Bit Server VM warning: ignoring option
> MaxPermSize=256m; support was removed in 8.0
> Java HotSpot(TM) 64-Bit Server VM warning: ignoring option
> MaxPermSize=256m; support was removed in 8.0
> Java HotSpot(TM) 64-Bit Server VM warning: ignoring option
> MaxPermSize=256m; support was removed in 8.0
> Running org.apache.hadoop.hbase.master.TestMasterStatusServlet
> Tests run: 4, Failures: 0, Errors: 0, Skipped: 0, Time elapsed: 3.056 sec
> - in org.apache.hadoop.hbase.master.TestMasterStatusServlet
> Java HotSpot(TM) 64-Bit Server VM warning: ignoring option
> MaxPermSize=256m; support was removed in 8.0
> Running org.apache.hadoop.hbase.master.cleaner.TestHFileLinkCleaner
> Tests run: 1, Failures: 0, Errors: 0, Skipped: 0, Time elapsed: 11.453 sec
> - in org.apache.hadoop.hbase.master.cleaner.TestHFileLinkCleaner
> Java HotSpot(TM) 64-Bit Server VM warning: ignoring option
> MaxPermSize=256m; support was removed in 8.0
> Running
> org.apache.hadoop.hbase.master.normalizer.TestSimpleRegionNormalizerOnCluster
> Running org.apache.hadoop.hbase.master.cleaner.TestSnapshotFromMaster
> Tests run: 20, Failures: 0, Errors: 0, Skipped: 1, Time elapsed: 295.224
> sec - in org.apache.hadoop.hbase.master.balancer.TestStochasticLoadBalancer
> Java HotSpot(TM) 64-Bit Server VM warning: ignoring option
> MaxPermSize=256m; support was removed in 8.0
> Tests run: 2, Failures: 0, Errors: 0, Skipped: 0, Time elapsed: 47.06 sec
> - in
> org.apache.hadoop.hbase.master.normalizer.TestSimpleRegionNormalizerOnCluster
> Java HotSpot(TM) 64-Bit Server VM warning: ignoring option
> MaxPermSize=256m; support was removed in 8.0
> Java HotSpot(TM) 64-Bit Server VM warning: ignoring option
> MaxPermSize=256m; support was removed in 8.0
> Java HotSpot(TM) 64-Bit Server VM warning: ignoring option
> MaxPermSize=256m; support was removed in 8.0
> Running org.apache.hadoop.hbase.master.cleaner.TestLogsCleaner
> Running org.apache.hadoop.hbase.master.cleaner.TestHFileCleaner
> Tests run: 3, Failures: 0, Errors: 0, Skipped: 0, Time elapsed: 1.88 sec -
> in org.apache.hadoop.hbase.master.cleaner.TestHFileCleaner
> Java HotSpot(TM) 64-Bit Server VM warning: ignoring option
> MaxPermSize=256m; support was removed in 8.0
> Tests run: 15, Failures: 0, Errors: 0, Skipped: 1, Time elapsed: 144.72
> sec - in org.apache.hadoop.hbase.master.TestSplitLogManager
> Java HotSpot(TM) 64-Bit Server VM warning: ignoring option
> MaxPermSize=256m; support was removed in 8.0
> Tests run: 4, Failures: 0, Errors: 0, Skipped: 0, Time elapsed: 42.422 sec
> - in org.apache.hadoop.hbase.master.cleaner.TestSnapshotFromMaster
> Java HotSpot(TM) 64-Bit Server VM warning: ignoring option
> MaxPermSize=256m; support was removed in 8.0
> Java HotSpot(TM) 64-Bit Server VM warning: ignoring option
> MaxPermSize=256m; support was removed in 8.0
> Tests run: 3, Failures: 0, Errors: 0, Skipped: 0, Time elapsed: 13.211 sec
> - in org.apache.hadoop.hbase.master.cleaner.TestLogsCleaner
> Java HotSpot(TM) 64-Bit Server VM warning: ignoring option
> MaxPermSize=256m; support was removed in 8.0
> Running org.apache.hadoop.hbase.master.TestMasterRestartAfterDisablingTable
> Running org.apache.hadoop.hbase.master.TestDistributedLogSplitting
> Running org.apache.hadoop.hbase.master.TestMasterMetrics
> Tests run: 3, Failures: 0, Errors: 0, Skipped: 0, Time elapsed: 2.288 sec
> - in org.apache.hadoop.hbase.master.TestMasterMetrics
> Java HotSpot(TM) 64-Bit Server VM warning: ignoring option
> MaxPermSize=256m; support was removed in 8.0
> Running org.apache.hadoop.hbase.master.TestRegionPlacement
> Tests run: 2, Failures: 0, Errors: 0, Skipped: 2, Time elapsed: 0.009 sec
> - in org.apache.hadoop.hbase.master.TestRegionPlacement
> Java HotSpot(TM) 64-Bit Server VM warning: ignoring option
> MaxPermSize=256m; support was removed in 8.0
> Java HotSpot(TM) 64-Bit Server VM warning: ignoring option
> MaxPermSize=256m; support was removed in 8.0
> Java HotSpot(TM) 64-Bit Server VM warning: ignoring option
> MaxPermSize=256m; support was removed in 8.0
> Running
> org.apache.hadoop.hbase.master.TestMasterOperationsForRegionReplicas
> Tests run: 1, Failures: 0, Errors: 0, Skipped: 0, Time elapsed: 34.946 sec
> - in org.apache.hadoop.hbase.master.TestMasterRestartAfterDisablingTable
> Java HotSpot(TM) 64-Bit Server VM warning: ignoring option
> MaxPermSize=256m; support was removed in 8.0
> Running org.apache.hadoop.hbase.master.TestAssignmentListener
> Tests run: 2, Failures: 0, Errors: 0, Skipped: 0, Time elapsed: 14.227 sec
> - in org.apache.hadoop.hbase.master.TestAssignmentListener
> Java HotSpot(TM) 64-Bit Server VM warning: ignoring option
> MaxPermSize=256m; support was removed in 8.0
> Java HotSpot(TM) 64-Bit Server VM warning: ignoring option
> MaxPermSize=256m; support was removed in 8.0
> Java HotSpot(TM) 64-Bit Server VM warning: ignoring option
> MaxPermSize=256m; support was removed in 8.0
> Tests run: 2, Failures: 0, Errors: 0, Skipped: 0, Time elapsed: 33.771 sec
> - in org.apache.hadoop.hbase.master.TestMasterOperationsForRegionReplicas
> Java HotSpot(TM) 64-Bit Server VM warning: ignoring option
> MaxPermSize=256m; support was removed in 8.0
> Running org.apache.hadoop.hbase.master.TestMasterMetricsWrapper
> Java HotSpot(TM) 64-Bit Server VM warning: ignoring option
> MaxPermSize=256m; support was removed in 8.0
> Java HotSpot(TM) 64-Bit Server VM warning: ignoring option
> MaxPermSize=256m; support was removed in 8.0
> Tests run: 1, Failures: 0, Errors: 0, Skipped: 0, Time elapsed: 2.863 sec
> - in org.apache.hadoop.hbase.master.TestMasterMetricsWrapper
> Java HotSpot(TM) 64-Bit Server VM warning: ignoring option
> MaxPermSize=256m; support was removed in 8.0
> Running org.apache.hadoop.hbase.snapshot.TestSnapshotClientRetries
> Tests run: 18, Failures: 0, Errors: 0, Skipped: 15, Time elapsed: 63.596
> sec - in org.apache.hadoop.hbase.master.TestDistributedLogSplitting
> Java HotSpot(TM) 64-Bit Server VM warning: ignoring option
> MaxPermSize=256m; support was removed in 8.0
> Running org.apache.hadoop.hbase.master.snapshot.TestSnapshotFileCache
> Running org.apache.hadoop.hbase.snapshot.TestFlushSnapshotFromClient
> Tests run: 2, Failures: 0, Errors: 0, Skipped: 0, Time elapsed: 35.246 sec
> - in org.apache.hadoop.hbase.snapshot.TestSnapshotClientRetries
> Java HotSpot(TM) 64-Bit Server VM warning: ignoring option
> MaxPermSize=256m; support was removed in 8.0
> Running org.apache.hadoop.hbase.snapshot.TestExportSnapshot
> Running org.apache.hadoop.hbase.snapshot.TestMobFlushSnapshotFromClient
> Tests run: 4, Failures: 0, Errors: 0, Skipped: 0, Time elapsed: 73.685 sec
> - in org.apache.hadoop.hbase.master.snapshot.TestSnapshotFileCache
> Java HotSpot(TM) 64-Bit Server VM warning: ignoring option
> MaxPermSize=256m; support was removed in 8.0
> Running org.apache.hadoop.hbase.snapshot.TestSnapshotDescriptionUtils
> Tests run: 2, Failures: 0, Errors: 0, Skipped: 0, Time elapsed: 0.23 sec -
> in org.apache.hadoop.hbase.snapshot.TestSnapshotDescriptionUtils
> Java HotSpot(TM) 64-Bit Server VM warning: ignoring option
> MaxPermSize=256m; support was removed in 8.0
> Running org.apache.hadoop.hbase.snapshot.TestMobSecureExportSnapshot
> Tests run: 4, Failures: 0, Errors: 0, Skipped: 0, Time elapsed: 545.412
> sec - in org.apache.hadoop.hbase.master.balancer.TestStochasticLoadBalancer2
> Java HotSpot(TM) 64-Bit Server VM warning: ignoring option
> MaxPermSize=256m; support was removed in 8.0
> Tests run: 9, Failures: 0, Errors: 0, Skipped: 0, Time elapsed: 109.647
> sec - in org.apache.hadoop.hbase.snapshot.TestMobFlushSnapshotFromClient
> Java HotSpot(TM) 64-Bit Server VM warning: ignoring option
> MaxPermSize=256m; support was removed in 8.0
> Java HotSpot(TM) 64-Bit Server VM warning: ignoring option
> MaxPermSize=256m; support was removed in 8.0
> Java HotSpot(TM) 64-Bit Server VM warning: ignoring option
> MaxPermSize=256m; support was removed in 8.0
> Running
> org.apache.hadoop.hbase.snapshot.TestMobRestoreFlushSnapshotFromClient
> Running org.apache.hadoop.hbase.snapshot.TestMobExportSnapshot
> Tests run: 5, Failures: 0, Errors: 0, Skipped: 0, Time elapsed: 155.716
> sec - in
> org.apache.hadoop.hbase.snapshot.TestMobRestoreFlushSnapshotFromClient
> Java HotSpot(TM) 64-Bit Server VM warning: ignoring option
> MaxPermSize=256m; support was removed in 8.0
> Running org.apache.hadoop.hbase.snapshot.TestRestoreFlushSnapshotFromClient
> Tests run: 5, Failures: 0, Errors: 0, Skipped: 0, Time elapsed: 89.049 sec
> - in org.apache.hadoop.hbase.snapshot.TestRestoreFlushSnapshotFromClient
> Java HotSpot(TM) 64-Bit Server VM warning: ignoring option
> MaxPermSize=256m; support was removed in 8.0
> Running org.apache.hadoop.hbase.snapshot.TestSecureExportSnapshot
> Tests run: 9, Failures: 0, Errors: 0, Skipped: 0, Time elapsed: 495.868
> sec - in org.apache.hadoop.hbase.snapshot.TestExportSnapshot
> Tests run: 9, Failures: 0, Errors: 0, Skipped: 0, Time elapsed: 531.195
> sec - in org.apache.hadoop.hbase.snapshot.TestMobSecureExportSnapshot
> Tests run: 9, Failures: 0, Errors: 0, Skipped: 0, Time elapsed: 492.485
> sec - in org.apache.hadoop.hbase.snapshot.TestMobExportSnapshot
> Tests run: 9, Failures: 0, Errors: 0, Skipped: 0, Time elapsed: 401.485
> sec - in org.apache.hadoop.hbase.snapshot.TestSecureExportSnapshot
>
> Results :
>
> Tests run: 2755, Failures: 0, Errors: 0, Skipped: 65
>
> [INFO]
> ------------------------------------------------------------------------
> [INFO] Reactor Summary:
> [INFO]
> [INFO] Apache HBase ...................................... SUCCESS [
> 5.149 s]
> [INFO] Apache HBase - Checkstyle ......................... SUCCESS [
> 0.875 s]
> [INFO] Apache HBase - Resource Bundle .................... SUCCESS [
> 0.300 s]
> [INFO] Apache HBase - Annotations ........................ SUCCESS [
> 0.334 s]
> [INFO] Apache HBase - Protocol ........................... SUCCESS [
> 3.248 s]
> [INFO] Apache HBase - Common ............................. SUCCESS [02:06
> min]
> [INFO] Apache HBase - Procedure .......................... SUCCESS [03:05
> min]
> [INFO] Apache HBase - Client ............................. SUCCESS [
> 53.718 s]
> [INFO] Apache HBase - Hadoop Compatibility ............... SUCCESS [
> 9.812 s]
> [INFO] Apache HBase - Hadoop Two Compatibility ........... SUCCESS [
> 13.926 s]
> [INFO] Apache HBase - Prefix Tree ........................ SUCCESS [
> 14.407 s]
> [INFO] Apache HBase - Server ............................. FAILURE [
> 02:24 h]
> [INFO] Apache HBase - Testing Util ....................... SKIPPED
> [INFO] Apache HBase - Thrift ............................. SKIPPED
> [INFO] Apache HBase - RSGroup ............................ SKIPPED
> [INFO] Apache HBase - Shell .............................. SKIPPED
> [INFO] Apache HBase - Integration Tests .................. SKIPPED
> [INFO] Apache HBase - Examples ........................... SKIPPED
> [INFO] Apache HBase - Rest ............................... SKIPPED
> [INFO] Apache HBase - External Block Cache ............... SKIPPED
> [INFO] Apache HBase - Spark .............................. SKIPPED
> [INFO] Apache HBase - Assembly ........................... SKIPPED
> [INFO] Apache HBase - Shaded ............................. SKIPPED
> [INFO] Apache HBase - Shaded - Client .................... SKIPPED
> [INFO] Apache HBase - Shaded - Server .................... SKIPPED
> [INFO] Apache HBase - Archetypes ......................... SKIPPED
> [INFO] Apache HBase - Exemplar for hbase-client archetype  SKIPPED
> [INFO] Apache HBase - Exemplar for hbase-shaded-client archetype  SKIPPED
> [INFO] Apache HBase - Archetype builder .................. SKIPPED
> [INFO]
> ------------------------------------------------------------------------
> [INFO] BUILD FAILURE
> [INFO]
> ------------------------------------------------------------------------
> [INFO] Total time: 02:31 h
> [INFO] Finished at: 2016-04-12T04:31:51+00:00
> [INFO] Final Memory: 488M/2311M
> [INFO]
> ------------------------------------------------------------------------
> [ERROR] Failed to execute goal
> org.apache.maven.plugins:maven-surefire-plugin:2.18.1:test
> (secondPartTestsExecution) on project hbase-server: There was a timeout or
> other error in the fork -> [Help 1]
> [ERROR]
> [ERROR] To see the full stack trace of the errors, re-run Maven with the
> -e switch.
> [ERROR] Re-run Maven using the -X switch to enable full debug logging.
> [ERROR]
> [ERROR] For more information about the errors and possible solutions,
> please read the following articles:
> [ERROR] [Help 1]
> http://cwiki.apache.org/confluence/display/MAVEN/MojoFailureException
> [ERROR]
> [ERROR] After correcting the problems, you can resume the build with the
> command
> [ERROR]   mvn <goals> -rf :hbase-server
> Build step 'Invoke top-level Maven targets' marked build as failure
> Performing Post build task...
> Match found for :.* : True
> Logical operation result is TRUE
> Running script  : # Run zombie detector script
> ./dev-support/zombie-detector.sh --jenkins ${BUILD_ID}
> [yahoo-not-h2] $ /bin/bash -xe /tmp/hudson8803335173753693349.sh
> + ./dev-support/zombie-detector.sh --jenkins 840
> Tue Apr 12 04:31:53 UTC 2016 Found 1 suspicious java process(es) listed
> below; waiting 30s to see if just slow to stop
> 27536 surefirebooter2336494482403808723.jar -enableassertions -
> Dhbase.build.id=840 -Xmx2800m -XX:MaxPermSize=256m
> -Djava.security.egd=file:/dev/./urandom -Djava.net.preferIPv4Stack=true
> -Djava.awt.headless=true
> tail: cannot open '+2' for reading: No such file or directory
> Tue Apr 12 04:32:23 UTC 2016 We're ok: there was a zombie candidate but it
> went away
>
>
>     {color:green}+1 zombies{color}. No zombie tests found running at the
> end of the build (There were candidates but they seem to have gone away).
> POST BUILD TASK : SUCCESS
> END OF POST BUILD TASK : 0
> Archiving artifacts
> Recording test results
> [FINDBUGS] Skipping publisher since build result is FAILURE
> [CHECKSTYLE] Skipping publisher since build result is FAILURE
>

Mime
  • Unnamed multipart/alternative (inline, None, 0 bytes)
View raw message