hbase-dev mailing list archives

Site index · List index
Message view « Date » · « Thread »
Top « Date » · « Thread »
From Ted Yu <yuzhih...@gmail.com>
Subject Re: Build failed in Jenkins: HBase-1.3 » latest1.8,yahoo-not-h2 #602
Date Wed, 16 Mar 2016 13:50:25 GMT
HBASE-15456 has been rolled back due to unit test failure. 

FYI 

> On Mar 15, 2016, at 10:10 PM, Stack <stack@duboce.net> wrote:
> 
> Could these two commits have been responsible for the below? Caused fail in
> 1.7 and 1.8.
> St.Ack
> 
> On Tue, Mar 15, 2016 at 9:10 PM, Apache Jenkins Server <
> jenkins@builds.apache.org> wrote:
> 
>> See <
>> https://builds.apache.org/job/HBase-1.3/jdk=latest1.8,label=yahoo-not-h2/602/changes
>> 
>> Changes:
>> 
>> [enis] HBASE-15377 Per-RS Get metric is time based, per-region metric is
>> 
>> [tedyu] HBASE-15456 CreateTableProcedure/ModifyTableProcedure needs to
>> fail when
>> 
>> ------------------------------------------
>> [...truncated 47519 lines...]
>> Tests run: 1, Failures: 0, Errors: 0, Skipped: 0, Time elapsed: 25.237 sec
>> - in org.apache.hadoop.hbase.master.TestGetLastFlushedSequenceId
>> Java HotSpot(TM) 64-Bit Server VM warning: ignoring option
>> MaxPermSize=256m; support was removed in 8.0
>> Tests run: 1, Failures: 0, Errors: 0, Skipped: 0, Time elapsed: 5.793 sec
>> - in org.apache.hadoop.hbase.master.TestHMasterRPCException
>> Running org.apache.hadoop.hbase.master.TestSplitLogManager
>> Java HotSpot(TM) 64-Bit Server VM warning: ignoring option
>> MaxPermSize=256m; support was removed in 8.0
>> Running org.apache.hadoop.hbase.master.TestClusterStatusPublisher
>> Tests run: 3, Failures: 0, Errors: 0, Skipped: 0, Time elapsed: 1.088 sec
>> - in org.apache.hadoop.hbase.master.TestClusterStatusPublisher
>> Java HotSpot(TM) 64-Bit Server VM warning: ignoring option
>> MaxPermSize=256m; support was removed in 8.0
>> Running org.apache.hadoop.hbase.master.TestGetInfoPort
>> Running org.apache.hadoop.hbase.master.TestMaster
>> Tests run: 1, Failures: 0, Errors: 0, Skipped: 0, Time elapsed: 16.452 sec
>> - in org.apache.hadoop.hbase.master.TestGetInfoPort
>> Java HotSpot(TM) 64-Bit Server VM warning: ignoring option
>> MaxPermSize=256m; support was removed in 8.0
>> Tests run: 1, Failures: 0, Errors: 0, Skipped: 0, Time elapsed: 40.779 sec
>> - in org.apache.hadoop.hbase.master.TestRollingRestart
>> Java HotSpot(TM) 64-Bit Server VM warning: ignoring option
>> MaxPermSize=256m; support was removed in 8.0
>> Tests run: 4, Failures: 0, Errors: 0, Skipped: 0, Time elapsed: 16.581 sec
>> - in org.apache.hadoop.hbase.master.TestMaster
>> Java HotSpot(TM) 64-Bit Server VM warning: ignoring option
>> MaxPermSize=256m; support was removed in 8.0
>> Java HotSpot(TM) 64-Bit Server VM warning: ignoring option
>> MaxPermSize=256m; support was removed in 8.0
>> Running org.apache.hadoop.hbase.master.TestDeadServer
>> Tests run: 4, Failures: 0, Errors: 0, Skipped: 0, Time elapsed: 3.077 sec
>> - in org.apache.hadoop.hbase.master.TestDeadServer
>> Java HotSpot(TM) 64-Bit Server VM warning: ignoring option
>> MaxPermSize=256m; support was removed in 8.0
>> Running org.apache.hadoop.hbase.master.TestMasterStatusServlet
>> Tests run: 4, Failures: 0, Errors: 0, Skipped: 0, Time elapsed: 2.356 sec
>> - in org.apache.hadoop.hbase.master.TestMasterStatusServlet
>> Java HotSpot(TM) 64-Bit Server VM warning: ignoring option
>> MaxPermSize=256m; support was removed in 8.0
>> Java HotSpot(TM) 64-Bit Server VM warning: ignoring option
>> MaxPermSize=256m; support was removed in 8.0
>> Running
>> org.apache.hadoop.hbase.master.normalizer.TestSimpleRegionNormalizerOnCluster
>> Running org.apache.hadoop.hbase.master.TestZKBasedOpenCloseRegion
>> Tests run: 3, Failures: 0, Errors: 0, Skipped: 0, Time elapsed: 4.307 sec
>> - in org.apache.hadoop.hbase.master.TestZKBasedOpenCloseRegion
>> Java HotSpot(TM) 64-Bit Server VM warning: ignoring option
>> MaxPermSize=256m; support was removed in 8.0
>> Running org.apache.hadoop.hbase.master.cleaner.TestSnapshotFromMaster
>> Running org.apache.hadoop.hbase.master.cleaner.TestHFileCleaner
>> Tests run: 3, Failures: 0, Errors: 0, Skipped: 0, Time elapsed: 1.557 sec
>> - in org.apache.hadoop.hbase.master.cleaner.TestHFileCleaner
>> Java HotSpot(TM) 64-Bit Server VM warning: ignoring option
>> MaxPermSize=256m; support was removed in 8.0
>> Java HotSpot(TM) 64-Bit Server VM warning: ignoring option
>> MaxPermSize=256m; support was removed in 8.0
>> Java HotSpot(TM) 64-Bit Server VM warning: ignoring option
>> MaxPermSize=256m; support was removed in 8.0
>> Running org.apache.hadoop.hbase.master.cleaner.TestLogsCleaner
>> Tests run: 2, Failures: 0, Errors: 0, Skipped: 0, Time elapsed: 32.722 sec
>> - in
>> org.apache.hadoop.hbase.master.normalizer.TestSimpleRegionNormalizerOnCluster
>> Java HotSpot(TM) 64-Bit Server VM warning: ignoring option
>> MaxPermSize=256m; support was removed in 8.0
>> Tests run: 2, Failures: 0, Errors: 0, Skipped: 0, Time elapsed: 11.951 sec
>> - in org.apache.hadoop.hbase.master.cleaner.TestLogsCleaner
>> Java HotSpot(TM) 64-Bit Server VM warning: ignoring option
>> MaxPermSize=256m; support was removed in 8.0
>> Java HotSpot(TM) 64-Bit Server VM warning: ignoring option
>> MaxPermSize=256m; support was removed in 8.0
>> Tests run: 4, Failures: 0, Errors: 0, Skipped: 0, Time elapsed: 32.896 sec
>> - in org.apache.hadoop.hbase.master.cleaner.TestSnapshotFromMaster
>> Java HotSpot(TM) 64-Bit Server VM warning: ignoring option
>> MaxPermSize=256m; support was removed in 8.0
>> Running org.apache.hadoop.hbase.master.TestMasterMetrics
>> Running org.apache.hadoop.hbase.master.TestMasterRestartAfterDisablingTable
>> Tests run: 3, Failures: 0, Errors: 0, Skipped: 0, Time elapsed: 1.746 sec
>> - in org.apache.hadoop.hbase.master.TestMasterMetrics
>> Java HotSpot(TM) 64-Bit Server VM warning: ignoring option
>> MaxPermSize=256m; support was removed in 8.0
>> Running org.apache.hadoop.hbase.master.TestRegionPlacement
>> Tests run: 2, Failures: 0, Errors: 0, Skipped: 2, Time elapsed: 0.002 sec
>> - in org.apache.hadoop.hbase.master.TestRegionPlacement
>> Java HotSpot(TM) 64-Bit Server VM warning: ignoring option
>> MaxPermSize=256m; support was removed in 8.0
>> Java HotSpot(TM) 64-Bit Server VM warning: ignoring option
>> MaxPermSize=256m; support was removed in 8.0
>> Java HotSpot(TM) 64-Bit Server VM warning: ignoring option
>> MaxPermSize=256m; support was removed in 8.0
>> Running
>> org.apache.hadoop.hbase.master.TestMasterOperationsForRegionReplicas
>> Running org.apache.hadoop.hbase.master.TestAssignmentListener
>> Tests run: 1, Failures: 0, Errors: 0, Skipped: 0, Time elapsed: 22.905 sec
>> - in org.apache.hadoop.hbase.master.TestMasterRestartAfterDisablingTable
>> Java HotSpot(TM) 64-Bit Server VM warning: ignoring option
>> MaxPermSize=256m; support was removed in 8.0
>> Tests run: 2, Failures: 0, Errors: 0, Skipped: 0, Time elapsed: 11.181 sec
>> - in org.apache.hadoop.hbase.master.TestAssignmentListener
>> Java HotSpot(TM) 64-Bit Server VM warning: ignoring option
>> MaxPermSize=256m; support was removed in 8.0
>> Tests run: 15, Failures: 0, Errors: 0, Skipped: 1, Time elapsed: 137.35
>> sec - in org.apache.hadoop.hbase.master.TestSplitLogManager
>> Java HotSpot(TM) 64-Bit Server VM warning: ignoring option
>> MaxPermSize=256m; support was removed in 8.0
>> Java HotSpot(TM) 64-Bit Server VM warning: ignoring option
>> MaxPermSize=256m; support was removed in 8.0
>> Java HotSpot(TM) 64-Bit Server VM warning: ignoring option
>> MaxPermSize=256m; support was removed in 8.0
>> Tests run: 20, Failures: 0, Errors: 0, Skipped: 1, Time elapsed: 306.779
>> sec - in org.apache.hadoop.hbase.master.balancer.TestStochasticLoadBalancer
>> Running org.apache.hadoop.hbase.master.TestMasterPriorityRpc
>> Java HotSpot(TM) 64-Bit Server VM warning: ignoring option
>> MaxPermSize=256m; support was removed in 8.0
>> Tests run: 2, Failures: 0, Errors: 0, Skipped: 0, Time elapsed: 28.498 sec
>> - in org.apache.hadoop.hbase.master.TestMasterOperationsForRegionReplicas
>> Java HotSpot(TM) 64-Bit Server VM warning: ignoring option
>> MaxPermSize=256m; support was removed in 8.0
>> Java HotSpot(TM) 64-Bit Server VM warning: ignoring option
>> MaxPermSize=256m; support was removed in 8.0
>> Running org.apache.hadoop.hbase.snapshot.TestSnapshotClientRetries
>> Tests run: 3, Failures: 0, Errors: 0, Skipped: 0, Time elapsed: 4.543 sec
>> - in org.apache.hadoop.hbase.master.TestMasterPriorityRpc
>> Java HotSpot(TM) 64-Bit Server VM warning: ignoring option
>> MaxPermSize=256m; support was removed in 8.0
>> Running org.apache.hadoop.hbase.master.snapshot.TestSnapshotFileCache
>> Running org.apache.hadoop.hbase.master.TestMasterMetricsWrapper
>> Tests run: 1, Failures: 0, Errors: 0, Skipped: 0, Time elapsed: 2.67 sec -
>> in org.apache.hadoop.hbase.master.TestMasterMetricsWrapper
>> Java HotSpot(TM) 64-Bit Server VM warning: ignoring option
>> MaxPermSize=256m; support was removed in 8.0
>> Running org.apache.hadoop.hbase.snapshot.TestSnapshotDescriptionUtils
>> Tests run: 2, Failures: 0, Errors: 0, Skipped: 0, Time elapsed: 0.309 sec
>> - in org.apache.hadoop.hbase.snapshot.TestSnapshotDescriptionUtils
>> Java HotSpot(TM) 64-Bit Server VM warning: ignoring option
>> MaxPermSize=256m; support was removed in 8.0
>> Java HotSpot(TM) 64-Bit Server VM warning: ignoring option
>> MaxPermSize=256m; support was removed in 8.0
>> Running org.apache.hadoop.hbase.snapshot.TestFlushSnapshotFromClient
>> Tests run: 2, Failures: 0, Errors: 0, Skipped: 0, Time elapsed: 31.736 sec
>> - in org.apache.hadoop.hbase.snapshot.TestSnapshotClientRetries
>> Java HotSpot(TM) 64-Bit Server VM warning: ignoring option
>> MaxPermSize=256m; support was removed in 8.0
>> Running org.apache.hadoop.hbase.snapshot.TestRestoreFlushSnapshotFromClient
>> Running org.apache.hadoop.hbase.snapshot.TestExportSnapshot
>> Tests run: 4, Failures: 0, Errors: 0, Skipped: 0, Time elapsed: 51.011 sec
>> - in org.apache.hadoop.hbase.master.snapshot.TestSnapshotFileCache
>> Running org.apache.hadoop.hbase.snapshot.TestSecureExportSnapshot
>> Tests run: 9, Failures: 0, Errors: 0, Skipped: 0, Time elapsed: 90.597 sec
>> - in org.apache.hadoop.hbase.snapshot.TestFlushSnapshotFromClient
>> Tests run: 5, Failures: 0, Errors: 0, Skipped: 0, Time elapsed: 96.146 sec
>> - in org.apache.hadoop.hbase.snapshot.TestRestoreFlushSnapshotFromClient
>> Tests run: 9, Failures: 0, Errors: 0, Skipped: 0, Time elapsed: 370.508
>> sec - in org.apache.hadoop.hbase.snapshot.TestExportSnapshot
>> Tests run: 9, Failures: 0, Errors: 0, Skipped: 0, Time elapsed: 364.376
>> sec - in org.apache.hadoop.hbase.snapshot.TestSecureExportSnapshot
>> 
>> Results :
>> 
>> Tests in error:
>> 
>> org.apache.hadoop.hbase.master.TestOpenedRegionHandler.testShouldNotCompeleteOpenedRegionSuccessfullyIfVersionMismatches(org.apache.hadoop.hbase.master.TestOpenedRegionHandler)
>>  Run 1:
>> TestOpenedRegionHandler.testShouldNotCompeleteOpenedRegionSuccessfullyIfVersionMismatches:129
>> » DoNotRetryIO
>>  Run 2:
>> TestOpenedRegionHandler.testShouldNotCompeleteOpenedRegionSuccessfullyIfVersionMismatches:129
>> » DoNotRetryIO
>>  Run 3:
>> TestOpenedRegionHandler.testShouldNotCompeleteOpenedRegionSuccessfullyIfVersionMismatches:129
>> » DoNotRetryIO
>> 
>> 
>> org.apache.hadoop.hbase.regionserver.handler.TestCloseRegionHandler.testCloseRegion(org.apache.hadoop.hbase.regionserver.handler.TestCloseRegionHandler)
>>  Run 1: TestCloseRegionHandler.testCloseRegion:214 » NodeExists
>> KeeperErrorCode = Node...
>>  Run 2: TestCloseRegionHandler.testCloseRegion:214 » NodeExists
>> KeeperErrorCode = Node...
>>  Run 3: TestCloseRegionHandler.testCloseRegion:214 » NodeExists
>> KeeperErrorCode = Node...
>> 
>> 
>> org.apache.hadoop.hbase.regionserver.handler.TestCloseRegionHandler.testFailedFlushAborts(org.apache.hadoop.hbase.regionserver.handler.TestCloseRegionHandler)
>>  Run 1: TestCloseRegionHandler.testFailedFlushAborts:104 » DoNotRetryIO
>> Table TestClos...
>>  Run 2: TestCloseRegionHandler.testFailedFlushAborts:104 » DoNotRetryIO
>> Table TestClos...
>>  Run 3: TestCloseRegionHandler.testFailedFlushAborts:104 » DoNotRetryIO
>> Table TestClos...
>> 
>> 
>> org.apache.hadoop.hbase.regionserver.handler.TestCloseRegionHandler.testZKClosingNodeVersionMismatch(org.apache.hadoop.hbase.regionserver.handler.TestCloseRegionHandler)
>>  Run 1: TestCloseRegionHandler.testZKClosingNodeVersionMismatch:168 »
>> NodeExists Keepe...
>>  Run 2: TestCloseRegionHandler.testZKClosingNodeVersionMismatch:168 »
>> NodeExists Keepe...
>>  Run 3: TestCloseRegionHandler.testZKClosingNodeVersionMismatch:168 »
>> NodeExists Keepe...
>> 
>> 
>> org.apache.hadoop.hbase.regionserver.handler.TestOpenRegionHandler.testRegionServerAbortionDueToFailureTransitioningToOpened(org.apache.hadoop.hbase.regionserver.handler.TestOpenRegionHandler)
>>  Run 1:
>> TestOpenRegionHandler.testRegionServerAbortionDueToFailureTransitioningToOpened:162
>> » DoNotRetryIO
>>  Run 2:
>> TestOpenRegionHandler.testRegionServerAbortionDueToFailureTransitioningToOpened:162
>> » DoNotRetryIO
>>  Run 3:
>> TestOpenRegionHandler.testRegionServerAbortionDueToFailureTransitioningToOpened:162
>> » DoNotRetryIO
>> 
>> 
>> org.apache.hadoop.hbase.regionserver.handler.TestOpenRegionHandler.testYankingRegionFromUnderIt(org.apache.hadoop.hbase.regionserver.handler.TestOpenRegionHandler)
>>  Run 1: TestOpenRegionHandler.testYankingRegionFromUnderIt:99 »
>> DoNotRetryIO Table Tes...
>>  Run 2: TestOpenRegionHandler.testYankingRegionFromUnderIt:99 »
>> DoNotRetryIO Table Tes...
>>  Run 3: TestOpenRegionHandler.testYankingRegionFromUnderIt:99 »
>> DoNotRetryIO Table Tes...
>> 
>> Flaked tests:
>> 
>> org.apache.hadoop.hbase.regionserver.TestHRegion.testFlushCacheWhileScanning(org.apache.hadoop.hbase.regionserver.TestHRegion)
>>  Run 1: TestHRegion.testFlushCacheWhileScanning:3751 i=940 expected:<94>
>> but was:<93>
>>  Run 2: PASS
>> 
>> 
>> Tests run: 2492, Failures: 0, Errors: 6, Skipped: 42, Flakes: 1
>> 
>> [INFO]
>> ------------------------------------------------------------------------
>> [INFO] Reactor Summary:
>> [INFO]
>> [INFO] Apache HBase ...................................... SUCCESS
>> [49.329s]
>> [INFO] Apache HBase - Checkstyle ......................... SUCCESS [4.743s]
>> [INFO] Apache HBase - Resource Bundle .................... SUCCESS [0.370s]
>> [INFO] Apache HBase - Annotations ........................ SUCCESS [2.041s]
>> [INFO] Apache HBase - Protocol ........................... SUCCESS
>> [21.174s]
>> [INFO] Apache HBase - Common ............................. SUCCESS
>> [2:18.156s]
>> [INFO] Apache HBase - Procedure .......................... SUCCESS
>> [3:35.688s]
>> [INFO] Apache HBase - Client ............................. SUCCESS
>> [1:29.251s]
>> [INFO] Apache HBase - Hadoop Compatibility ............... SUCCESS [9.099s]
>> [INFO] Apache HBase - Hadoop Two Compatibility ........... SUCCESS
>> [10.829s]
>> [INFO] Apache HBase - Prefix Tree ........................ SUCCESS
>> [10.306s]
>> [INFO] Apache HBase - Server ............................. FAILURE
>> [1:43:50.775s]
>> [INFO] Apache HBase - Testing Util ....................... SKIPPED
>> [INFO] Apache HBase - Thrift ............................. SKIPPED
>> [INFO] Apache HBase - Rest ............................... SKIPPED
>> [INFO] Apache HBase - Shell .............................. SKIPPED
>> [INFO] Apache HBase - Integration Tests .................. SKIPPED
>> [INFO] Apache HBase - Examples ........................... SKIPPED
>> [INFO] Apache HBase - External Block Cache ............... SKIPPED
>> [INFO] Apache HBase - Assembly ........................... SKIPPED
>> [INFO] Apache HBase - Shaded ............................. SKIPPED
>> [INFO] Apache HBase - Shaded - Client .................... SKIPPED
>> [INFO] Apache HBase - Shaded - Server .................... SKIPPED
>> [INFO]
>> ------------------------------------------------------------------------
>> [INFO] BUILD FAILURE
>> [INFO]
>> ------------------------------------------------------------------------
>> [INFO] Total time: 1:53:19.012s
>> [INFO] Finished at: Wed Mar 16 04:04:56 UTC 2016
>> [INFO] Final Memory: 96M/966M
>> [INFO]
>> ------------------------------------------------------------------------
>> [ERROR] Failed to execute goal
>> org.apache.maven.plugins:maven-surefire-plugin:2.18.1:test
>> (secondPartTestsExecution) on project hbase-server: There are test failures.
>> [ERROR]
>> [ERROR] Please refer to <
>> https://builds.apache.org/job/HBase-1.3/jdk=latest1.8,label=yahoo-not-h2/ws/hbase-server/target/surefire-reports>
>> for the individual test results.
>> [ERROR] -> [Help 1]
>> [ERROR]
>> [ERROR] To see the full stack trace of the errors, re-run Maven with the
>> -e switch.
>> [ERROR] Re-run Maven using the -X switch to enable full debug logging.
>> [ERROR]
>> [ERROR] For more information about the errors and possible solutions,
>> please read the following articles:
>> [ERROR] [Help 1]
>> http://cwiki.apache.org/confluence/display/MAVEN/MojoFailureException
>> [ERROR]
>> [ERROR] After correcting the problems, you can resume the build with the
>> command
>> [ERROR]   mvn <goals> -rf :hbase-server
>> Build step 'Invoke top-level Maven targets' marked build as failure
>> Performing Post build task...
>> Match found for :.* : True
>> Logical operation result is TRUE
>> Running script  : # Post-build task script. TODO: Check this in and have
>> all builds reference check-in.
>> pwd && ls
>> # NOTE!!!! The below code has been copied and pasted from
>> ./dev-tools/run-test.sh
>> # Do not change here without syncing there and vice-versa.
>> ZOMBIE_TESTS_COUNT=`jps -v | grep surefirebooter | grep -e '-Dhbase.test'
>> | wc -l`
>> if [[ $ZOMBIE_TESTS_COUNT != 0 ]] ; then
>> echo "Suspicious java process found - waiting 30s to see if there are
>> just slow to stop"
>> sleep 30
>> ZOMBIE_TESTS_COUNT=`jps -v | grep surefirebooter | grep -e '-Dhbase.test'
>> | wc -l`
>> if [[ $ZOMBIE_TESTS_COUNT != 0 ]] ; then
>>   echo " {color:red}There appear to be $ZOMBIE_TESTS_COUNT zombie
>> tests{color}, they should have been killed by surefire but survived"
>>   jps -v | grep surefirebooter | grep -e '-Dhbase.test'
>>   jps -v | grep surefirebooter | grep -e '-Dhbase.test' | cut -d ' ' -f 1
>> | xargs -n 1 jstack
>>   # Exit with error
>>   exit 1
>> else
>>   echo "We're ok: there is no zombie test, but some tests took some time
>> to stop"
>> fi
>> else
>>  echo "We're ok: there is no zombie test"
>> fi
>> [yahoo-not-h2] $ /bin/bash -xe /tmp/hudson2326325297605324535.sh
>> + pwd
>> <
>> https://builds.apache.org/job/HBase-1.3/jdk=latest1.8,label=yahoo-not-h2/ws/
>> + ls
>> bin
>> CHANGES.txt
>> conf
>> dev-support
>> hbase-annotations
>> hbase-assembly
>> hbase-checkstyle
>> hbase-client
>> hbase-common
>> hbase-examples
>> hbase-external-blockcache
>> hbase-hadoop2-compat
>> hbase-hadoop-compat
>> hbase-it
>> hbase-native-client
>> hbase-prefix-tree
>> hbase-procedure
>> hbase-protocol
>> hbase-resource-bundle
>> hbase-rest
>> hbase-server
>> hbase-shaded
>> hbase-shell
>> hbase-testing-util
>> hbase-thrift
>> LICENSE.txt
>> NOTICE.txt
>> pom.xml
>> README.txt
>> src
>> target
>> ++ jps -v
>> ++ wc -l
>> ++ grep -e -Dhbase.test
>> ++ grep surefirebooter
>> + ZOMBIE_TESTS_COUNT=0
>> + [[ 0 != 0 ]]
>> + echo 'We'\''re ok: there is no zombie test'
>> We're ok: there is no zombie test
>> POST BUILD TASK : SUCCESS
>> END OF POST BUILD TASK : 0
>> Archiving artifacts
>> Recording test results
>> 

Mime
View raw message