hbase-dev mailing list archives

Site index · List index
Message view « Date » · « Thread »
Top « Date » · « Thread »
From Stack <st...@duboce.net>
Subject Re: Build failed in Jenkins: HBase-Trunk_matrix » latest1.7,yahoo-not-h2 #674
Date Wed, 03 Feb 2016 00:47:35 GMT
These tests usually pass. Failure is rare. Keeping an eye on them.
St.Ack

On Tue, Feb 2, 2016 at 3:36 PM, Apache Jenkins Server <
jenkins@builds.apache.org> wrote:

> See <
> https://builds.apache.org/job/HBase-Trunk_matrix/jdk=latest1.7,label=yahoo-not-h2/674/changes
> >
>
> Changes:
>
> [tedyu] HBASE-15192
> TestRegionMergeTransactionOnCluster#testCleanMergeReference
>
> [stack] HBASE-15196 HBASE-15158 Preamble 2 of 2:Add Increment tests
>
> ------------------------------------------
> [...truncated 4774 lines...]
> Running
> org.apache.hadoop.hbase.security.visibility.TestVisibilityLabelsWithDeletes
> Tests run: 1, Failures: 0, Errors: 0, Skipped: 0, Time elapsed: 3.825 sec
> - in
> org.apache.hadoop.hbase.security.visibility.TestVisibilityLabelsWithSLGStack
> Running
> org.apache.hadoop.hbase.security.visibility.TestVisibilityLabelsReplication
> Tests run: 1, Failures: 0, Errors: 0, Skipped: 0, Time elapsed: 32.559 sec
> - in
> org.apache.hadoop.hbase.security.visibility.TestVisibilityLabelReplicationWithExpAsString
> Running
> org.apache.hadoop.hbase.security.visibility.TestEnforcingScanLabelGenerator
> Tests run: 1, Failures: 0, Errors: 0, Skipped: 0, Time elapsed: 3.854 sec
> - in
> org.apache.hadoop.hbase.security.visibility.TestEnforcingScanLabelGenerator
> Tests run: 1, Failures: 0, Errors: 0, Skipped: 0, Time elapsed: 32.48 sec
> - in
> org.apache.hadoop.hbase.security.visibility.TestVisibilityLabelsReplication
> Running
> org.apache.hadoop.hbase.security.visibility.TestDefaultScanLabelGeneratorStack
> Tests run: 1, Failures: 0, Errors: 0, Skipped: 0, Time elapsed: 3.648 sec
> - in
> org.apache.hadoop.hbase.security.visibility.TestDefaultScanLabelGeneratorStack
> Running
> org.apache.hadoop.hbase.security.visibility.TestVisibilityWithCheckAuths
> Tests run: 5, Failures: 0, Errors: 0, Skipped: 0, Time elapsed: 77.486 sec
> - in org.apache.hadoop.hbase.mob.compactions.TestMobCompactor
> Tests run: 2, Failures: 0, Errors: 0, Skipped: 0, Time elapsed: 6.796 sec
> - in
> org.apache.hadoop.hbase.security.visibility.TestVisibilityWithCheckAuths
> Tests run: 7, Failures: 1, Errors: 0, Skipped: 0, Time elapsed: 221.265
> sec <<< FAILURE! - in
> org.apache.hadoop.hbase.replication.TestMasterReplication
> testCyclicReplication2(org.apache.hadoop.hbase.replication.TestMasterReplication)
> Time elapsed: 47.018 sec  <<< FAILURE!
> java.lang.AssertionError: Waited too much time for replication. Row:row4.
> IsDeleteReplication:true
>         at org.junit.Assert.fail(Assert.java:88)
>         at
> org.apache.hadoop.hbase.replication.TestMasterReplication.wait(TestMasterReplication.java:651)
>         at
> org.apache.hadoop.hbase.replication.TestMasterReplication.testCyclicReplication2(TestMasterReplication.java:274)
>
> Running
> org.apache.hadoop.hbase.security.visibility.TestVisibilityLabelsOpWithDifferentUsersNoACL
> Tests run: 1, Failures: 0, Errors: 0, Skipped: 0, Time elapsed: 2.382 sec
> - in
> org.apache.hadoop.hbase.security.visibility.TestVisibilityLabelsOpWithDifferentUsersNoACL
> Running
> org.apache.hadoop.hbase.security.visibility.TestWithDisabledAuthorization
> Running
> org.apache.hadoop.hbase.security.visibility.TestVisibilityLabelsWithDefaultVisLabelService
> Tests run: 2, Failures: 0, Errors: 0, Skipped: 0, Time elapsed: 4.468 sec
> - in
> org.apache.hadoop.hbase.security.visibility.TestWithDisabledAuthorization
> Running
> org.apache.hadoop.hbase.security.visibility.TestVisibilityLabelsWithACL
> Running
> org.apache.hadoop.hbase.security.visibility.TestVisibilityLablesWithGroups
> Tests run: 1, Failures: 0, Errors: 0, Skipped: 0, Time elapsed: 4.517 sec
> - in
> org.apache.hadoop.hbase.security.visibility.TestVisibilityLablesWithGroups
> Tests run: 5, Failures: 0, Errors: 0, Skipped: 0, Time elapsed: 13.305 sec
> - in org.apache.hadoop.hbase.security.visibility.TestVisibilityLabelsWithACL
> Running
> org.apache.hadoop.hbase.security.visibility.TestVisibilityLabelsWithCustomVisLabService
> Running org.apache.hadoop.hbase.security.access.TestAccessController2
> Running org.apache.hadoop.hbase.security.access.TestAccessController
> Tests run: 25, Failures: 0, Errors: 0, Skipped: 0, Time elapsed: 50.31 sec
> - in
> org.apache.hadoop.hbase.security.visibility.TestVisibilityLabelsWithDefaultVisLabelService
> Tests run: 21, Failures: 0, Errors: 0, Skipped: 0, Time elapsed: 46.989
> sec - in
> org.apache.hadoop.hbase.security.visibility.TestVisibilityLabelsWithCustomVisLabService
> Tests run: 44, Failures: 0, Errors: 0, Skipped: 0, Time elapsed: 151.218
> sec - in
> org.apache.hadoop.hbase.security.visibility.TestVisibilityLabelsWithDeletes
> Running org.apache.hadoop.hbase.security.access.TestTablePermissions
> Running org.apache.hadoop.hbase.security.access.TestAccessControlFilter
> Running org.apache.hadoop.hbase.security.access.TestCellACLs
> Tests run: 1, Failures: 0, Errors: 0, Skipped: 0, Time elapsed: 4.624 sec
> - in org.apache.hadoop.hbase.security.access.TestAccessControlFilter
> Tests run: 7, Failures: 0, Errors: 0, Skipped: 0, Time elapsed: 24.469 sec
> - in org.apache.hadoop.hbase.security.access.TestTablePermissions
> Tests run: 2, Failures: 0, Errors: 0, Skipped: 0, Time elapsed: 20.08 sec
> - in org.apache.hadoop.hbase.security.access.TestCellACLs
> Tests run: 6, Failures: 0, Errors: 0, Skipped: 0, Time elapsed: 77.905 sec
> - in org.apache.hadoop.hbase.security.access.TestAccessController2
> Running org.apache.hadoop.hbase.security.access.TestNamespaceCommands
> Running
> org.apache.hadoop.hbase.security.access.TestWithDisabledAuthorization
> Tests run: 7, Failures: 0, Errors: 0, Skipped: 0, Time elapsed: 12.842 sec
> - in org.apache.hadoop.hbase.security.access.TestNamespaceCommands
> Running org.apache.hadoop.hbase.security.access.TestZKPermissionsWatcher
> Running org.apache.hadoop.hbase.security.access.TestScanEarlyTermination
> Tests run: 1, Failures: 0, Errors: 0, Skipped: 0, Time elapsed: 3.703 sec
> - in org.apache.hadoop.hbase.security.access.TestZKPermissionsWatcher
> Tests run: 1, Failures: 0, Errors: 0, Skipped: 0, Time elapsed: 9.342 sec
> - in org.apache.hadoop.hbase.security.access.TestScanEarlyTermination
> Running org.apache.hadoop.hbase.security.token.TestZKSecretWatcher
> Running
> org.apache.hadoop.hbase.security.access.TestCellACLWithMultipleVersions
> Running org.apache.hadoop.hbase.security.access.TestAccessController3
> Tests run: 1, Failures: 0, Errors: 0, Skipped: 0, Time elapsed: 7.285 sec
> - in org.apache.hadoop.hbase.security.access.TestAccessController3
> Tests run: 1, Failures: 0, Errors: 0, Skipped: 0, Time elapsed: 13.446 sec
> - in org.apache.hadoop.hbase.security.token.TestZKSecretWatcher
> Tests run: 59, Failures: 0, Errors: 0, Skipped: 0, Time elapsed: 110.981
> sec - in org.apache.hadoop.hbase.security.access.TestAccessController
> Running org.apache.hadoop.hbase.TestMetaTableAccessorNoCluster
> Running org.apache.hadoop.hbase.security.token.TestTokenAuthentication
> Tests run: 3, Failures: 0, Errors: 0, Skipped: 0, Time elapsed: 0.662 sec
> - in org.apache.hadoop.hbase.security.token.TestTokenAuthentication
> Tests run: 2, Failures: 0, Errors: 0, Skipped: 0, Time elapsed: 3.801 sec
> - in org.apache.hadoop.hbase.TestMetaTableAccessorNoCluster
> Running org.apache.hadoop.hbase.TestMetaTableLocator
> Tests run: 7, Failures: 0, Errors: 0, Skipped: 0, Time elapsed: 4.74 sec -
> in org.apache.hadoop.hbase.TestMetaTableLocator
> Running org.apache.hadoop.hbase.TestZooKeeper
> Running org.apache.hadoop.hbase.TestHBaseTestingUtility
> Tests run: 6, Failures: 0, Errors: 0, Skipped: 0, Time elapsed: 56.152 sec
> - in org.apache.hadoop.hbase.security.access.TestWithDisabledAuthorization
> Running org.apache.hadoop.hbase.snapshot.TestSnapshotDescriptionUtils
> Tests run: 2, Failures: 0, Errors: 0, Skipped: 0, Time elapsed: 0.109 sec
> - in org.apache.hadoop.hbase.snapshot.TestSnapshotDescriptionUtils
> Running org.apache.hadoop.hbase.security.token.TestGenerateDelegationToken
> Tests run: 1, Failures: 0, Errors: 0, Skipped: 0, Time elapsed: 9.984 sec
> - in org.apache.hadoop.hbase.security.token.TestGenerateDelegationToken
> Running org.apache.hadoop.hbase.snapshot.TestMobSecureExportSnapshot
> Tests run: 8, Failures: 0, Errors: 0, Skipped: 0, Time elapsed: 73.146 sec
> - in org.apache.hadoop.hbase.security.access.TestCellACLWithMultipleVersions
> Running org.apache.hadoop.hbase.snapshot.TestSecureExportSnapshot
> Running org.apache.hadoop.hbase.snapshot.TestMobExportSnapshot
> Tests run: 12, Failures: 0, Errors: 0, Skipped: 0, Time elapsed: 89.206
> sec - in org.apache.hadoop.hbase.TestHBaseTestingUtility
> Running
> org.apache.hadoop.hbase.snapshot.TestMobRestoreFlushSnapshotFromClient
> Tests run: 5, Failures: 0, Errors: 0, Skipped: 0, Time elapsed: 113.475
> sec - in
> org.apache.hadoop.hbase.snapshot.TestMobRestoreFlushSnapshotFromClient
> Running org.apache.hadoop.hbase.snapshot.TestFlushSnapshotFromClient
> Tests run: 10, Failures: 0, Errors: 0, Skipped: 0, Time elapsed: 256.534
> sec - in org.apache.hadoop.hbase.TestZooKeeper
> Running org.apache.hadoop.hbase.snapshot.TestExportSnapshot
> Tests run: 9, Failures: 0, Errors: 0, Skipped: 0, Time elapsed: 119.699
> sec - in org.apache.hadoop.hbase.snapshot.TestFlushSnapshotFromClient
> Running org.apache.hadoop.hbase.snapshot.TestSnapshotClientRetries
> Tests run: 2, Failures: 0, Errors: 0, Skipped: 0, Time elapsed: 24.034 sec
> - in org.apache.hadoop.hbase.snapshot.TestSnapshotClientRetries
> Tests run: 9, Failures: 0, Errors: 0, Skipped: 0, Time elapsed: 346.356
> sec - in org.apache.hadoop.hbase.snapshot.TestMobSecureExportSnapshot
> Running org.apache.hadoop.hbase.snapshot.TestRestoreFlushSnapshotFromClient
> Running org.apache.hadoop.hbase.TestInfoServers
> Tests run: 3, Failures: 0, Errors: 0, Skipped: 0, Time elapsed: 4.688 sec
> - in org.apache.hadoop.hbase.TestInfoServers
> Tests run: 9, Failures: 0, Errors: 0, Skipped: 0, Time elapsed: 348.753
> sec - in org.apache.hadoop.hbase.snapshot.TestSecureExportSnapshot
> Running org.apache.hadoop.hbase.quotas.TestQuotaAdmin
> Tests run: 3, Failures: 0, Errors: 0, Skipped: 0, Time elapsed: 4.288 sec
> - in org.apache.hadoop.hbase.quotas.TestQuotaAdmin
> Tests run: 9, Failures: 0, Errors: 0, Skipped: 0, Time elapsed: 346.58 sec
> - in org.apache.hadoop.hbase.snapshot.TestMobExportSnapshot
> Running org.apache.hadoop.hbase.procedure.TestZKProcedureControllers
> Tests run: 4, Failures: 0, Errors: 0, Skipped: 0, Time elapsed: 4.312 sec
> - in org.apache.hadoop.hbase.procedure.TestZKProcedureControllers
> Running org.apache.hadoop.hbase.procedure.TestZKProcedure
> Running org.apache.hadoop.hbase.quotas.TestQuotaThrottle
> Tests run: 4, Failures: 0, Errors: 0, Skipped: 0, Time elapsed: 3.616 sec
> - in org.apache.hadoop.hbase.procedure.TestZKProcedure
> Running org.apache.hadoop.hbase.quotas.TestQuotaTableUtil
> Tests run: 3, Failures: 0, Errors: 0, Skipped: 0, Time elapsed: 1.701 sec
> - in org.apache.hadoop.hbase.quotas.TestQuotaTableUtil
> Running org.apache.hadoop.hbase.io.hfile.TestScannerFromBucketCache
> Running org.apache.hadoop.hbase.io.hfile.TestCacheOnWrite
> Tests run: 4, Failures: 0, Errors: 0, Skipped: 0, Time elapsed: 5.091 sec
> - in org.apache.hadoop.hbase.io.hfile.TestScannerFromBucketCache
> Running org.apache.hadoop.hbase.io.hfile.TestForceCacheImportantBlocks
> Tests run: 12, Failures: 0, Errors: 0, Skipped: 0, Time elapsed: 32.235
> sec - in org.apache.hadoop.hbase.quotas.TestQuotaThrottle
> Tests run: 5, Failures: 0, Errors: 0, Skipped: 0, Time elapsed: 73.812 sec
> - in org.apache.hadoop.hbase.snapshot.TestRestoreFlushSnapshotFromClient
> Running org.apache.hadoop.hbase.io.hfile.TestHFileBlock
> Running org.apache.hadoop.hbase.io.hfile.TestHFileBlockIndex
> Tests run: 2, Failures: 0, Errors: 0, Skipped: 0, Time elapsed: 26.791 sec
> - in org.apache.hadoop.hbase.io.hfile.TestForceCacheImportantBlocks
> Running org.apache.hadoop.hbase.io.hfile.TestSeekBeforeWithInlineBlocks
> Tests run: 10, Failures: 0, Errors: 0, Skipped: 0, Time elapsed: 13.721
> sec - in org.apache.hadoop.hbase.io.hfile.TestHFileBlockIndex
> Running org.apache.hadoop.hbase.io.hfile.TestHFileSeek
> Tests run: 1, Failures: 0, Errors: 0, Skipped: 0, Time elapsed: 3.151 sec
> - in org.apache.hadoop.hbase.io.hfile.TestHFileSeek
> Tests run: 1, Failures: 0, Errors: 0, Skipped: 0, Time elapsed: 15.486 sec
> - in org.apache.hadoop.hbase.io.hfile.TestSeekBeforeWithInlineBlocks
> Running org.apache.hadoop.hbase.io.hfile.TestScannerSelectionUsingTTL
> Running org.apache.hadoop.hbase.io.hfile.TestCacheConfig
> Tests run: 6, Failures: 0, Errors: 0, Skipped: 0, Time elapsed: 3.05 sec -
> in org.apache.hadoop.hbase.io.hfile.TestCacheConfig
> Running org.apache.hadoop.hbase.io.encoding.TestDataBlockEncoders
> Tests run: 28, Failures: 0, Errors: 0, Skipped: 0, Time elapsed: 93.024
> sec - in org.apache.hadoop.hbase.io.hfile.TestHFileBlock
> Running org.apache.hadoop.hbase.io.encoding.TestEncodedSeekers
> Tests run: 6, Failures: 0, Errors: 0, Skipped: 0, Time elapsed: 64.752 sec
> - in org.apache.hadoop.hbase.io.hfile.TestScannerSelectionUsingTTL
> Running org.apache.hadoop.hbase.io.encoding.TestBufferedDataBlockEncoder
> Tests run: 2, Failures: 0, Errors: 0, Skipped: 0, Time elapsed: 14.525 sec
> - in org.apache.hadoop.hbase.io.encoding.TestBufferedDataBlockEncoder
> Running org.apache.hadoop.hbase.io.encoding.TestChangingEncoding
> Tests run: 56, Failures: 0, Errors: 0, Skipped: 0, Time elapsed: 96.733
> sec - in org.apache.hadoop.hbase.io.encoding.TestDataBlockEncoders
> Running org.apache.hadoop.hbase.io.encoding.TestLoadAndSwitchEncodeOnDisk
> Tests run: 9, Failures: 0, Errors: 0, Skipped: 0, Time elapsed: 342.334
> sec - in org.apache.hadoop.hbase.snapshot.TestExportSnapshot
> Tests run: 72, Failures: 0, Errors: 0, Skipped: 0, Time elapsed: 184.334
> sec - in org.apache.hadoop.hbase.io.hfile.TestCacheOnWrite
> Running org.apache.hadoop.hbase.io.TestFileLink
> Running org.apache.hadoop.hbase.wal.TestWALFactory
> Tests run: 1, Failures: 0, Errors: 0, Skipped: 0, Time elapsed: 36.542 sec
> - in org.apache.hadoop.hbase.io.encoding.TestLoadAndSwitchEncodeOnDisk
> Running org.apache.hadoop.hbase.wal.TestWALFiltering
> Tests run: 5, Failures: 0, Errors: 0, Skipped: 0, Time elapsed: 17.066 sec
> - in org.apache.hadoop.hbase.io.TestFileLink
> Running org.apache.hadoop.hbase.wal.TestWALReaderOnSecureWAL
> Tests run: 2, Failures: 0, Errors: 0, Skipped: 0, Time elapsed: 2.02 sec -
> in org.apache.hadoop.hbase.wal.TestWALReaderOnSecureWAL
> Tests run: 9, Failures: 0, Errors: 0, Skipped: 0, Time elapsed: 12.4 sec -
> in org.apache.hadoop.hbase.wal.TestWALFactory
> Running org.apache.hadoop.hbase.wal.TestBoundedRegionGroupingStrategy
> Running org.apache.hadoop.hbase.wal.TestDefaultWALProvider
> Tests run: 5, Failures: 0, Errors: 0, Skipped: 0, Time elapsed: 8.007 sec
> - in org.apache.hadoop.hbase.wal.TestDefaultWALProvider
> Running org.apache.hadoop.hbase.wal.TestSecureWAL
> Tests run: 1, Failures: 0, Errors: 0, Skipped: 0, Time elapsed: 1.517 sec
> - in org.apache.hadoop.hbase.wal.TestSecureWAL
> Tests run: 1, Failures: 0, Errors: 0, Skipped: 0, Time elapsed: 32.973 sec
> - in org.apache.hadoop.hbase.wal.TestWALFiltering
> Running org.apache.hadoop.hbase.wal.TestDefaultWALProviderWithHLogKey
> Tests run: 5, Failures: 0, Errors: 0, Skipped: 0, Time elapsed: 25.67 sec
> - in org.apache.hadoop.hbase.wal.TestBoundedRegionGroupingStrategy
> Running org.apache.hadoop.hbase.zookeeper.TestZKLeaderManager
> Tests run: 1, Failures: 0, Errors: 0, Skipped: 0, Time elapsed: 0.225 sec
> - in org.apache.hadoop.hbase.zookeeper.TestZKLeaderManager
> Running org.apache.hadoop.hbase.zookeeper.TestZooKeeperNodeTracker
> Tests run: 5, Failures: 0, Errors: 0, Skipped: 0, Time elapsed: 8.819 sec
> - in org.apache.hadoop.hbase.wal.TestDefaultWALProviderWithHLogKey
> Tests run: 3, Failures: 0, Errors: 0, Skipped: 0, Time elapsed: 1 sec - in
> org.apache.hadoop.hbase.zookeeper.TestZooKeeperNodeTracker
> Running org.apache.hadoop.hbase.zookeeper.TestRecoverableZooKeeper
> Running org.apache.hadoop.hbase.zookeeper.TestZKMulti
> Tests run: 1, Failures: 0, Errors: 0, Skipped: 0, Time elapsed: 1.339 sec
> - in org.apache.hadoop.hbase.zookeeper.TestRecoverableZooKeeper
> Running org.apache.hadoop.hbase.zookeeper.TestZooKeeperACL
> Tests run: 7, Failures: 0, Errors: 0, Skipped: 0, Time elapsed: 0.372 sec
> - in org.apache.hadoop.hbase.zookeeper.TestZooKeeperACL
> Running
> org.apache.hadoop.hbase.zookeeper.lock.TestZKInterProcessReadWriteLock
> Tests run: 12, Failures: 0, Errors: 0, Skipped: 0, Time elapsed: 3.44 sec
> - in org.apache.hadoop.hbase.zookeeper.TestZKMulti
> Tests run: 20, Failures: 0, Errors: 0, Skipped: 0, Time elapsed: 134.098
> sec - in org.apache.hadoop.hbase.io.encoding.TestEncodedSeekers
> Running org.apache.hadoop.hbase.zookeeper.TestHQuorumPeer
> Tests run: 3, Failures: 0, Errors: 0, Skipped: 0, Time elapsed: 0.777 sec
> - in org.apache.hadoop.hbase.zookeeper.TestHQuorumPeer
> Running org.apache.hadoop.hbase.TestIOFencing
> Running org.apache.hadoop.hbase.TestMovedRegionsCleaner
> Running org.apache.hadoop.hbase.constraint.TestConstraint
> Tests run: 1, Failures: 0, Errors: 0, Skipped: 0, Time elapsed: 13.889 sec
> - in org.apache.hadoop.hbase.TestMovedRegionsCleaner
> Tests run: 6, Failures: 0, Errors: 0, Skipped: 0, Time elapsed: 25.04 sec
> - in org.apache.hadoop.hbase.zookeeper.lock.TestZKInterProcessReadWriteLock
> Running
> org.apache.hadoop.hbase.backup.example.TestZooKeeperTableArchiveClient
> Tests run: 3, Failures: 0, Errors: 0, Skipped: 0, Time elapsed: 4.382 sec
> - in org.apache.hadoop.hbase.backup.example.TestZooKeeperTableArchiveClient
> Running org.apache.hadoop.hbase.backup.TestHFileArchiving
> Running org.apache.hadoop.hbase.TestHColumnDescriptorDefaultVersions
> Tests run: 5, Failures: 0, Errors: 0, Skipped: 0, Time elapsed: 33.639 sec
> - in org.apache.hadoop.hbase.constraint.TestConstraint
> Running org.apache.hadoop.hbase.ipc.TestProtoBufRpc
> Tests run: 1, Failures: 0, Errors: 0, Skipped: 0, Time elapsed: 2.349 sec
> - in org.apache.hadoop.hbase.ipc.TestProtoBufRpc
> Running org.apache.hadoop.hbase.ipc.TestRpcClientLeaks
> Tests run: 4, Failures: 0, Errors: 0, Skipped: 0, Time elapsed: 34.79 sec
> - in org.apache.hadoop.hbase.TestHColumnDescriptorDefaultVersions
> Running org.apache.hadoop.hbase.ipc.TestHBaseClient
> Tests run: 1, Failures: 0, Errors: 0, Skipped: 0, Time elapsed: 0.476 sec
> - in org.apache.hadoop.hbase.ipc.TestHBaseClient
> Tests run: 3, Failures: 0, Errors: 0, Skipped: 0, Time elapsed: 193.63 sec
> - in org.apache.hadoop.hbase.io.encoding.TestChangingEncoding
> Tests run: 1, Failures: 0, Errors: 0, Skipped: 0, Time elapsed: 28.253 sec
> - in org.apache.hadoop.hbase.ipc.TestRpcClientLeaks
> Running org.apache.hadoop.hbase.TestNamespace
> Tests run: 2, Failures: 0, Errors: 0, Skipped: 0, Time elapsed: 119.617
> sec - in org.apache.hadoop.hbase.TestIOFencing
> Tests run: 5, Failures: 0, Errors: 0, Skipped: 0, Time elapsed: 109.674
> sec - in org.apache.hadoop.hbase.backup.TestHFileArchiving
> Tests run: 8, Failures: 0, Errors: 0, Skipped: 0, Time elapsed: 61.335 sec
> - in org.apache.hadoop.hbase.TestNamespace
>
> Results :
>
> Failed tests:
>   TestMasterReplication.testCyclicReplication2:274->wait:651 Waited too
> much time for replication. Row:row4. IsDeleteReplication:true
>
> Tests run: 2503, Failures: 1, Errors: 0, Skipped: 36
>
> [INFO]
> ------------------------------------------------------------------------
> [INFO] Reactor Summary:
> [INFO]
> [INFO] Apache HBase ...................................... SUCCESS [
> 2.756 s]
> [INFO] Apache HBase - Checkstyle ......................... SUCCESS [
> 0.671 s]
> [INFO] Apache HBase - Resource Bundle .................... SUCCESS [
> 0.296 s]
> [INFO] Apache HBase - Annotations ........................ SUCCESS [
> 0.223 s]
> [INFO] Apache HBase - Protocol ........................... SUCCESS [
> 3.079 s]
> [INFO] Apache HBase - Common ............................. SUCCESS [01:32
> min]
> [INFO] Apache HBase - Procedure .......................... SUCCESS [02:24
> min]
> [INFO] Apache HBase - Client ............................. SUCCESS [
> 38.012 s]
> [INFO] Apache HBase - Hadoop Compatibility ............... SUCCESS [
> 7.958 s]
> [INFO] Apache HBase - Hadoop Two Compatibility ........... SUCCESS [
> 8.336 s]
> [INFO] Apache HBase - Prefix Tree ........................ SUCCESS [
> 11.246 s]
> [INFO] Apache HBase - Server ............................. FAILURE [
> 01:37 h]
> [INFO] Apache HBase - Testing Util ....................... SKIPPED
> [INFO] Apache HBase - Thrift ............................. SKIPPED
> [INFO] Apache HBase - Shell .............................. SKIPPED
> [INFO] Apache HBase - Integration Tests .................. SKIPPED
> [INFO] Apache HBase - Examples ........................... SKIPPED
> [INFO] Apache HBase - Rest ............................... SKIPPED
> [INFO] Apache HBase - External Block Cache ............... SKIPPED
> [INFO] Apache HBase - Assembly ........................... SKIPPED
> [INFO] Apache HBase - Shaded ............................. SKIPPED
> [INFO] Apache HBase - Shaded - Client .................... SKIPPED
> [INFO] Apache HBase - Shaded - Server .................... SKIPPED
> [INFO] Apache HBase - Spark .............................. SKIPPED
> [INFO]
> ------------------------------------------------------------------------
> [INFO] BUILD FAILURE
> [INFO]
> ------------------------------------------------------------------------
> [INFO] Total time: 01:43 h
> [INFO] Finished at: 2016-02-02T23:33:43+00:00
> [INFO] Final Memory: 65M/653M
> [INFO]
> ------------------------------------------------------------------------
> [ERROR] Failed to execute goal
> org.apache.maven.plugins:maven-surefire-plugin:2.18.1:test
> (secondPartTestsExecution) on project hbase-server: There are test failures.
> [ERROR]
> [ERROR] Please refer to <
> https://builds.apache.org/job/HBase-Trunk_matrix/jdk=latest1.7,label=yahoo-not-h2/ws/hbase-server/target/surefire-reports>
> for the individual test results.
> [ERROR] -> [Help 1]
> [ERROR]
> [ERROR] To see the full stack trace of the errors, re-run Maven with the
> -e switch.
> [ERROR] Re-run Maven using the -X switch to enable full debug logging.
> [ERROR]
> [ERROR] For more information about the errors and possible solutions,
> please read the following articles:
> [ERROR] [Help 1]
> http://cwiki.apache.org/confluence/display/MAVEN/MojoFailureException
> [ERROR]
> [ERROR] After correcting the problems, you can resume the build with the
> command
> [ERROR]   mvn <goals> -rf :hbase-server
> Build step 'Invoke top-level Maven targets' marked build as failure
> Performing Post build task...
> Match found for :.* : True
> Logical operation result is TRUE
> Running script  : # Run zombie detector script
> ./dev-support/zombie-detector.sh --jenkins ${BUILD_ID}
> [yahoo-not-h2] $ /bin/bash -xe /tmp/hudson3281213750624175013.sh
> + ./dev-support/zombie-detector.sh --jenkins 674
> Tue Feb  2 23:33:44 UTC 2016 We're ok: there is no zombie test
>
>
>     {color:green}+1 zombies{color}. No zombie tests found running at the
> end of the build.
> POST BUILD TASK : SUCCESS
> END OF POST BUILD TASK : 0
> Archiving artifacts
> Recording test results
> [FINDBUGS] Skipping publisher since build result is FAILURE
> [CHECKSTYLE] Skipping publisher since build result is FAILURE
>

Mime
  • Unnamed multipart/alternative (inline, None, 0 bytes)
View raw message