hbase-dev mailing list archives

Site index · List index
Message view « Date » · « Thread »
Top « Date » · « Thread »
From Stack <st...@duboce.net>
Subject Re: Build failed in Jenkins: HBase-Trunk_matrix » latest1.7,Hadoop #618
Date Thu, 07 Jan 2016 22:21:10 GMT
This is TestWALReplay hanging. Am also seeing TestHRegion hanging too.

Fetching
https://builds.apache.org/job/HBase-Trunk_matrix/jdk=latest1.7,label=Hadoop/618/consoleText
Building remotely on H9 (Mapreduce Falcon Hadoop Pig Zookeeper Tez Hdfs) in
workspace
/home/jenkins/jenkins-slave/workspace/HBase-Trunk_matrix/jdk/latest1.7/label/Hadoop
Printing hanging tests
Hanging test : org.apache.hadoop.hbase.regionserver.wal.TestWALReplay

On Thu, Jan 7, 2016 at 11:38 AM, Apache Jenkins Server <
jenkins@builds.apache.org> wrote:

> See <
> https://builds.apache.org/job/HBase-Trunk_matrix/jdk=latest1.7,label=Hadoop/618/changes
> >
>
> Changes:
>
> [tedyu] HBASE-15070 DistributedHBaseCluster#restoreRegionServers() starts
> new RS
>
> ------------------------------------------
> [...truncated 4759 lines...]
> Tests run: 9, Failures: 0, Errors: 0, Skipped: 0, Time elapsed: 60.045 sec
> - in
> org.apache.hadoop.hbase.client.replication.TestReplicationAdminWithClusters
> Running org.apache.hadoop.hbase.client.TestClientOperationInterrupt
> Tests run: 12, Failures: 0, Errors: 0, Skipped: 0, Time elapsed: 30.332
> sec - in org.apache.hadoop.hbase.client.TestMultiParallel
> Running org.apache.hadoop.hbase.client.TestReplicasClient
> Tests run: 3, Failures: 0, Errors: 0, Skipped: 0, Time elapsed: 74.622 sec
> - in org.apache.hadoop.hbase.client.TestTableSnapshotScanner
> Running org.apache.hadoop.hbase.client.TestHTableMultiplexer
> Running org.apache.hadoop.hbase.client.TestBlockEvictionFromClient
> Tests run: 1, Failures: 0, Errors: 0, Skipped: 0, Time elapsed: 11.927 sec
> - in org.apache.hadoop.hbase.client.TestHTableMultiplexer
> Running org.apache.hadoop.hbase.TestMetaTableLocator
> Tests run: 7, Failures: 0, Errors: 0, Skipped: 0, Time elapsed: 4.153 sec
> - in org.apache.hadoop.hbase.TestMetaTableLocator
> Tests run: 1, Failures: 0, Errors: 0, Skipped: 0, Time elapsed: 54.356 sec
> - in org.apache.hadoop.hbase.client.TestClientOperationInterrupt
> Running org.apache.hadoop.hbase.TestMovedRegionsCleaner
> Running org.apache.hadoop.hbase.TestFullLogReconstruction
> Tests run: 1, Failures: 0, Errors: 0, Skipped: 0, Time elapsed: 13.503 sec
> - in org.apache.hadoop.hbase.TestMovedRegionsCleaner
> Running org.apache.hadoop.hbase.constraint.TestConstraint
> Tests run: 1, Failures: 0, Errors: 0, Skipped: 0, Time elapsed: 40.061 sec
> - in org.apache.hadoop.hbase.TestFullLogReconstruction
> Running org.apache.hadoop.hbase.zookeeper.TestHQuorumPeer
> Tests run: 3, Failures: 0, Errors: 0, Skipped: 0, Time elapsed: 0.797 sec
> - in org.apache.hadoop.hbase.zookeeper.TestHQuorumPeer
> Running org.apache.hadoop.hbase.zookeeper.TestZKLeaderManager
> Tests run: 1, Failures: 0, Errors: 0, Skipped: 0, Time elapsed: 0.598 sec
> - in org.apache.hadoop.hbase.zookeeper.TestZKLeaderManager
> Running org.apache.hadoop.hbase.zookeeper.TestRecoverableZooKeeper
> Tests run: 1, Failures: 0, Errors: 0, Skipped: 0, Time elapsed: 1.554 sec
> - in org.apache.hadoop.hbase.zookeeper.TestRecoverableZooKeeper
> Tests run: 5, Failures: 0, Errors: 0, Skipped: 0, Time elapsed: 37.093 sec
> - in org.apache.hadoop.hbase.constraint.TestConstraint
> Running org.apache.hadoop.hbase.zookeeper.TestZooKeeperNodeTracker
> Tests run: 5, Failures: 0, Errors: 0, Skipped: 0, Time elapsed: 180.478
> sec - in org.apache.hadoop.hbase.client.TestRestoreSnapshotFromClient
> Tests run: 3, Failures: 0, Errors: 0, Skipped: 0, Time elapsed: 1.192 sec
> - in org.apache.hadoop.hbase.zookeeper.TestZooKeeperNodeTracker
> Running
> org.apache.hadoop.hbase.zookeeper.lock.TestZKInterProcessReadWriteLock
> Running org.apache.hadoop.hbase.zookeeper.TestZKMulti
> Tests run: 12, Failures: 0, Errors: 0, Skipped: 0, Time elapsed: 3.812 sec
> - in org.apache.hadoop.hbase.zookeeper.TestZKMulti
> Running org.apache.hadoop.hbase.zookeeper.TestZooKeeperACL
> Tests run: 7, Failures: 0, Errors: 0, Skipped: 0, Time elapsed: 0.425 sec
> - in org.apache.hadoop.hbase.zookeeper.TestZooKeeperACL
> Running org.apache.hadoop.hbase.TestZooKeeper
> Tests run: 13, Failures: 0, Errors: 0, Skipped: 0, Time elapsed: 102.273
> sec - in org.apache.hadoop.hbase.client.TestBlockEvictionFromClient
> Running org.apache.hadoop.hbase.wal.TestDefaultWALProvider
> Running org.apache.hadoop.hbase.TestNamespace
> Tests run: 6, Failures: 0, Errors: 0, Skipped: 0, Time elapsed: 25.749 sec
> - in org.apache.hadoop.hbase.zookeeper.lock.TestZKInterProcessReadWriteLock
> Tests run: 5, Failures: 0, Errors: 0, Skipped: 0, Time elapsed: 9.967 sec
> - in org.apache.hadoop.hbase.wal.TestDefaultWALProvider
> Running org.apache.hadoop.hbase.wal.TestWALFiltering
> Running org.apache.hadoop.hbase.wal.TestWALFactory
> Tests run: 9, Failures: 0, Errors: 0, Skipped: 0, Time elapsed: 13.858 sec
> - in org.apache.hadoop.hbase.wal.TestWALFactory
> Running org.apache.hadoop.hbase.wal.TestBoundedRegionGroupingStrategy
> Tests run: 1, Failures: 0, Errors: 0, Skipped: 0, Time elapsed: 35.639 sec
> - in org.apache.hadoop.hbase.wal.TestWALFiltering
> Running org.apache.hadoop.hbase.wal.TestWALReaderOnSecureWAL
> Tests run: 2, Failures: 0, Errors: 0, Skipped: 0, Time elapsed: 2.264 sec
> - in org.apache.hadoop.hbase.wal.TestWALReaderOnSecureWAL
> Running org.apache.hadoop.hbase.wal.TestDefaultWALProviderWithHLogKey
> Tests run: 5, Failures: 0, Errors: 0, Skipped: 0, Time elapsed: 25.955 sec
> - in org.apache.hadoop.hbase.wal.TestBoundedRegionGroupingStrategy
> Running org.apache.hadoop.hbase.wal.TestSecureWAL
> Tests run: 1, Failures: 0, Errors: 0, Skipped: 0, Time elapsed: 1.471 sec
> - in org.apache.hadoop.hbase.wal.TestSecureWAL
> Running org.apache.hadoop.hbase.replication.TestReplicationTrackerZKImpl
> Tests run: 5, Failures: 0, Errors: 0, Skipped: 0, Time elapsed: 8.616 sec
> - in org.apache.hadoop.hbase.wal.TestDefaultWALProviderWithHLogKey
> Tests run: 8, Failures: 0, Errors: 0, Skipped: 0, Time elapsed: 64.335 sec
> - in org.apache.hadoop.hbase.TestNamespace
> Tests run: 5, Failures: 0, Errors: 0, Skipped: 0, Time elapsed: 1.39 sec -
> in org.apache.hadoop.hbase.replication.TestReplicationTrackerZKImpl
> Running
> org.apache.hadoop.hbase.replication.TestReplicationKillMasterRSCompressed
> Running
> org.apache.hadoop.hbase.replication.TestReplicationDisableInactivePeer
> Running
> org.apache.hadoop.hbase.replication.TestReplicationSyncUpToolWithBulkLoadedData
> Tests run: 1, Failures: 0, Errors: 0, Skipped: 0, Time elapsed: 19.778 sec
> - in
> org.apache.hadoop.hbase.replication.TestReplicationKillMasterRSCompressed
> Tests run: 1, Failures: 0, Errors: 0, Skipped: 0, Time elapsed: 21.854 sec
> - in org.apache.hadoop.hbase.replication.TestReplicationDisableInactivePeer
> Tests run: 1, Failures: 0, Errors: 0, Skipped: 0, Time elapsed: 44.795 sec
> - in
> org.apache.hadoop.hbase.replication.TestReplicationSyncUpToolWithBulkLoadedData
> Tests run: 14, Failures: 0, Errors: 0, Skipped: 0, Time elapsed: 276.653
> sec - in org.apache.hadoop.hbase.client.TestReplicasClient
> Running
> org.apache.hadoop.hbase.replication.multiwal.TestReplicationEndpointWithMultipleWAL
> Running
> org.apache.hadoop.hbase.replication.multiwal.TestReplicationKillMasterRSCompressedWithMultipleWAL
> Tests run: 4, Failures: 0, Errors: 0, Skipped: 0, Time elapsed: 13.527 sec
> - in
> org.apache.hadoop.hbase.replication.multiwal.TestReplicationEndpointWithMultipleWAL
> Running org.apache.hadoop.hbase.replication.TestReplicationSource
> Tests run: 1, Failures: 0, Errors: 0, Skipped: 0, Time elapsed: 0.231 sec
> - in org.apache.hadoop.hbase.replication.TestReplicationSource
> Running
> org.apache.hadoop.hbase.replication.multiwal.TestReplicationSyncUpToolWithMultipleWAL
> Tests run: 1, Failures: 0, Errors: 0, Skipped: 0, Time elapsed: 25.107 sec
> - in
> org.apache.hadoop.hbase.replication.multiwal.TestReplicationKillMasterRSCompressedWithMultipleWAL
> Running org.apache.hadoop.hbase.replication.TestReplicationSmallTests
> Running
> org.apache.hadoop.hbase.replication.regionserver.TestReplicationWALReaderManager
> Running org.apache.hadoop.hbase.replication.TestReplicationEndpoint
> Tests run: 4, Failures: 0, Errors: 0, Skipped: 0, Time elapsed: 11.261 sec
> - in org.apache.hadoop.hbase.replication.TestReplicationEndpoint
> Running
> org.apache.hadoop.hbase.replication.regionserver.TestReplicationSink
> Tests run: 1, Failures: 0, Errors: 0, Skipped: 0, Time elapsed: 62.13 sec
> - in
> org.apache.hadoop.hbase.replication.multiwal.TestReplicationSyncUpToolWithMultipleWAL
> Running
> org.apache.hadoop.hbase.replication.regionserver.TestReplicationSourceManager
> Tests run: 6, Failures: 0, Errors: 0, Skipped: 0, Time elapsed: 5.967 sec
> - in org.apache.hadoop.hbase.replication.regionserver.TestReplicationSink
> Tests run: 10, Failures: 0, Errors: 0, Skipped: 0, Time elapsed: 261.308
> sec - in org.apache.hadoop.hbase.TestZooKeeper
> Tests run: 7, Failures: 0, Errors: 0, Skipped: 0, Time elapsed: 4.395 sec
> - in
> org.apache.hadoop.hbase.replication.regionserver.TestReplicationSourceManager
> Tests run: 12, Failures: 0, Errors: 0, Skipped: 0, Time elapsed: 78.048
> sec - in org.apache.hadoop.hbase.replication.TestReplicationSmallTests
> Running org.apache.hadoop.hbase.replication.TestMasterReplication
> Running
> org.apache.hadoop.hbase.replication.regionserver.TestRegionReplicaReplicationEndpoint
> Running
> org.apache.hadoop.hbase.replication.regionserver.TestRegionReplicaReplicationEndpointNoMaster
> Running org.apache.hadoop.hbase.replication.TestReplicationKillMasterRS
> Tests run: 1, Failures: 0, Errors: 0, Skipped: 0, Time elapsed: 22.996 sec
> - in org.apache.hadoop.hbase.replication.TestReplicationKillMasterRS
> Tests run: 4, Failures: 0, Errors: 0, Skipped: 0, Time elapsed: 49.747 sec
> - in
> org.apache.hadoop.hbase.replication.regionserver.TestRegionReplicaReplicationEndpointNoMaster
> Running org.apache.hadoop.hbase.replication.TestPerTableCFReplication
> Running
> org.apache.hadoop.hbase.replication.TestReplicationChangingPeerRegionservers
> Tests run: 1, Failures: 0, Errors: 0, Skipped: 0, Time elapsed: 7.526 sec
> - in
> org.apache.hadoop.hbase.replication.TestReplicationChangingPeerRegionservers
> Tests run: 2, Failures: 0, Errors: 0, Skipped: 0, Time elapsed: 49.532 sec
> - in org.apache.hadoop.hbase.replication.TestPerTableCFReplication
> Running org.apache.hadoop.hbase.replication.TestMultiSlaveReplication
> Running org.apache.hadoop.hbase.replication.TestReplicationWithTags
> Tests run: 1, Failures: 0, Errors: 0, Skipped: 0, Time elapsed: 3.561 sec
> - in org.apache.hadoop.hbase.replication.TestReplicationWithTags
> Tests run: 9, Failures: 0, Errors: 0, Skipped: 0, Time elapsed: 164.444
> sec - in
> org.apache.hadoop.hbase.replication.regionserver.TestRegionReplicaReplicationEndpoint
> Tests run: 1, Failures: 0, Errors: 0, Skipped: 0, Time elapsed: 45.051 sec
> - in org.apache.hadoop.hbase.replication.TestMultiSlaveReplication
> Running org.apache.hadoop.hbase.replication.TestReplicationSyncUpTool
> Running org.apache.hadoop.hbase.replication.TestReplicationStateZKImpl
> Tests run: 8, Failures: 0, Errors: 0, Skipped: 0, Time elapsed: 5.076 sec
> - in org.apache.hadoop.hbase.replication.TestReplicationStateZKImpl
> Running org.apache.hadoop.hbase.TestStochasticBalancerJmxMetrics
> Running org.apache.hadoop.hbase.replication.TestReplicationKillSlaveRS
> Tests run: 2, Failures: 0, Errors: 0, Skipped: 0, Time elapsed: 1.952 sec
> - in org.apache.hadoop.hbase.TestStochasticBalancerJmxMetrics
> Running org.apache.hadoop.hbase.TestLocalHBaseCluster
> Tests run: 1, Failures: 0, Errors: 0, Skipped: 0, Time elapsed: 14.028 sec
> - in org.apache.hadoop.hbase.TestLocalHBaseCluster
> Tests run: 1, Failures: 0, Errors: 0, Skipped: 0, Time elapsed: 18.795 sec
> - in org.apache.hadoop.hbase.replication.TestReplicationKillSlaveRS
> Tests run: 7, Failures: 0, Errors: 0, Skipped: 0, Time elapsed: 221.538
> sec - in org.apache.hadoop.hbase.replication.TestMasterReplication
> Running org.apache.hadoop.hbase.fs.TestBlockReorder
> Running org.apache.hadoop.hbase.TestMetaTableAccessor
> Tests run: 8, Failures: 0, Errors: 0, Skipped: 0, Time elapsed: 308.185
> sec - in
> org.apache.hadoop.hbase.replication.regionserver.TestReplicationWALReaderManager
> Running org.apache.hadoop.hbase.TestMultiVersions
> Tests run: 1, Failures: 0, Errors: 0, Skipped: 0, Time elapsed: 73.081 sec
> - in org.apache.hadoop.hbase.replication.TestReplicationSyncUpTool
> Tests run: 3, Failures: 0, Errors: 0, Skipped: 0, Time elapsed: 15.125 sec
> - in org.apache.hadoop.hbase.TestMultiVersions
> Running org.apache.hadoop.hbase.filter.TestFilterWithScanLimits
> Tests run: 3, Failures: 0, Errors: 0, Skipped: 0, Time elapsed: 36.383 sec
> - in org.apache.hadoop.hbase.fs.TestBlockReorder
> Tests run: 14, Failures: 0, Errors: 0, Skipped: 0, Time elapsed: 28.815
> sec - in org.apache.hadoop.hbase.TestMetaTableAccessor
> Running org.apache.hadoop.hbase.filter.TestFuzzyRowAndColumnRangeFilter
> Tests run: 1, Failures: 0, Errors: 0, Skipped: 0, Time elapsed: 3.797 sec
> - in org.apache.hadoop.hbase.filter.TestFuzzyRowAndColumnRangeFilter
> Running org.apache.hadoop.hbase.filter.TestScanRowPrefix
> Running org.apache.hadoop.hbase.filter.TestColumnRangeFilter
> Tests run: 1, Failures: 0, Errors: 0, Skipped: 0, Time elapsed: 8.849 sec
> - in org.apache.hadoop.hbase.filter.TestScanRowPrefix
> Running org.apache.hadoop.hbase.filter.TestFuzzyRowFilterEndToEnd
> Running org.apache.hadoop.hbase.filter.TestFilterWrapper
> Tests run: 1, Failures: 0, Errors: 0, Skipped: 0, Time elapsed: 8.152 sec
> - in org.apache.hadoop.hbase.filter.TestColumnRangeFilter
> Tests run: 1, Failures: 0, Errors: 0, Skipped: 0, Time elapsed: 4.335 sec
> - in org.apache.hadoop.hbase.filter.TestFilterWrapper
> Running org.apache.hadoop.hbase.filter.TestMultiRowRangeFilter
> Running org.apache.hadoop.hbase.mapreduce.TestWALPlayer
> Running
> org.apache.hadoop.hbase.mapreduce.TestLoadIncrementalHFilesUseSecurityEndPoint
> Tests run: 1, Failures: 0, Errors: 0, Skipped: 0, Time elapsed: 54.137 sec
> - in org.apache.hadoop.hbase.filter.TestFilterWithScanLimits
> Tests run: 4, Failures: 0, Errors: 0, Skipped: 0, Time elapsed: 11.376 sec
> - in org.apache.hadoop.hbase.mapreduce.TestWALPlayer
> Running org.apache.hadoop.hbase.mapreduce.TestHLogRecordReader
> Tests run: 2, Failures: 0, Errors: 0, Skipped: 0, Time elapsed: 1.064 sec
> - in org.apache.hadoop.hbase.mapreduce.TestHLogRecordReader
> Tests run: 20, Failures: 0, Errors: 0, Skipped: 0, Time elapsed: 24.885
> sec - in org.apache.hadoop.hbase.filter.TestMultiRowRangeFilter
> Running org.apache.hadoop.hbase.mapreduce.TestHashTable
> Running
> org.apache.hadoop.hbase.mapreduce.TestImportTSVWithOperationAttributes
> Running org.apache.hadoop.hbase.mapreduce.TestMultiTableInputFormat
> Tests run: 1, Failures: 0, Errors: 0, Skipped: 0, Time elapsed: 17.936 sec
> - in org.apache.hadoop.hbase.mapreduce.TestHashTable
> Running org.apache.hadoop.hbase.mapreduce.TestWALRecordReader
> Tests run: 2, Failures: 0, Errors: 0, Skipped: 0, Time elapsed: 1.416 sec
> - in org.apache.hadoop.hbase.mapreduce.TestWALRecordReader
> Tests run: 2, Failures: 0, Errors: 0, Skipped: 0, Time elapsed: 27.593 sec
> - in org.apache.hadoop.hbase.mapreduce.TestImportTSVWithOperationAttributes
> Tests run: 4, Failures: 0, Errors: 0, Skipped: 0, Time elapsed: 35.239 sec
> - in org.apache.hadoop.hbase.mapreduce.TestMultiTableInputFormat
> Running org.apache.hadoop.hbase.mapreduce.TestSyncTable
> Running
> org.apache.hadoop.hbase.mapreduce.TestSecureLoadIncrementalHFilesSplitRecovery
> Running org.apache.hadoop.hbase.mapreduce.TestTimeRangeMapRed
> Tests run: 1, Failures: 0, Errors: 0, Skipped: 0, Time elapsed: 8.721 sec
> - in org.apache.hadoop.hbase.mapreduce.TestTimeRangeMapRed
> Running org.apache.hadoop.hbase.mapreduce.TestTableSnapshotInputFormat
> Tests run: 5, Failures: 0, Errors: 0, Skipped: 0, Time elapsed: 30.484 sec
> - in
> org.apache.hadoop.hbase.mapreduce.TestSecureLoadIncrementalHFilesSplitRecovery
> Tests run: 1, Failures: 0, Errors: 0, Skipped: 0, Time elapsed: 35.926 sec
> - in org.apache.hadoop.hbase.mapreduce.TestSyncTable
> Running org.apache.hadoop.hbase.mapreduce.TestImportTSVWithTTLs
> Running org.apache.hadoop.hbase.mapreduce.TestCellCounter
> Tests run: 1, Failures: 0, Errors: 0, Skipped: 0, Time elapsed: 15.305 sec
> - in org.apache.hadoop.hbase.mapreduce.TestImportTSVWithTTLs
> Running org.apache.hadoop.hbase.mapreduce.TestTableInputFormatScan1
> Tests run: 7, Failures: 0, Errors: 0, Skipped: 0, Time elapsed: 37.033 sec
> - in org.apache.hadoop.hbase.mapreduce.TestCellCounter
> Running org.apache.hadoop.hbase.mapreduce.TestHRegionPartitioner
> Tests run: 1, Failures: 0, Errors: 0, Skipped: 0, Time elapsed: 3.992 sec
> - in org.apache.hadoop.hbase.mapreduce.TestHRegionPartitioner
> Tests run: 18, Failures: 0, Errors: 0, Skipped: 0, Time elapsed: 186.619
> sec - in
> org.apache.hadoop.hbase.mapreduce.TestLoadIncrementalHFilesUseSecurityEndPoint
> Running org.apache.hadoop.hbase.mapreduce.TestLoadIncrementalHFiles
> Tests run: 7, Failures: 0, Errors: 0, Skipped: 0, Time elapsed: 41.272 sec
> - in org.apache.hadoop.hbase.mapreduce.TestTableInputFormatScan1
> Running org.apache.hadoop.hbase.mapreduce.TestSecureLoadIncrementalHFiles
> Running org.apache.hadoop.hbase.mapreduce.TestTableInputFormat
> Tests run: 8, Failures: 0, Errors: 0, Skipped: 0, Time elapsed: 25.806 sec
> - in org.apache.hadoop.hbase.mapreduce.TestTableInputFormat
> Tests run: 8, Failures: 0, Errors: 0, Skipped: 0, Time elapsed: 164.278
> sec - in org.apache.hadoop.hbase.mapreduce.TestTableSnapshotInputFormat
> Running org.apache.hadoop.hbase.mapreduce.TestTableInputFormatScan2
> Running org.apache.hadoop.hbase.mapreduce.TestImportExport
> Tests run: 7, Failures: 0, Errors: 0, Skipped: 0, Time elapsed: 39.596 sec
> - in org.apache.hadoop.hbase.mapreduce.TestTableInputFormatScan2
> Tests run: 3, Failures: 0, Errors: 0, Skipped: 0, Time elapsed: 330.671
> sec - in org.apache.hadoop.hbase.filter.TestFuzzyRowFilterEndToEnd
> Running org.apache.hadoop.hbase.mapreduce.TestRowCounter
> Running org.apache.hadoop.hbase.mapreduce.TestCopyTable
> Tests run: 6, Failures: 0, Errors: 0, Skipped: 0, Time elapsed: 36.367 sec
> - in org.apache.hadoop.hbase.mapreduce.TestRowCounter
> Tests run: 12, Failures: 0, Errors: 0, Skipped: 0, Time elapsed: 96.53 sec
> - in org.apache.hadoop.hbase.mapreduce.TestImportExport
> Running
> org.apache.hadoop.hbase.mapreduce.TestLoadIncrementalHFilesSplitRecovery
> Running org.apache.hadoop.hbase.mapreduce.TestHFileOutputFormat2
> Tests run: 14, Failures: 0, Errors: 0, Skipped: 14, Time elapsed: 0.004
> sec - in org.apache.hadoop.hbase.mapreduce.TestHFileOutputFormat2
> Tests run: 18, Failures: 0, Errors: 0, Skipped: 0, Time elapsed: 189.376
> sec - in org.apache.hadoop.hbase.mapreduce.TestLoadIncrementalHFiles
> Running org.apache.hadoop.hbase.mapreduce.TestMultithreadedTableMapper
> Tests run: 5, Failures: 0, Errors: 0, Skipped: 0, Time elapsed: 77.24 sec
> - in org.apache.hadoop.hbase.mapreduce.TestCopyTable
> Tests run: 18, Failures: 0, Errors: 0, Skipped: 0, Time elapsed: 197.98
> sec - in org.apache.hadoop.hbase.mapreduce.TestSecureLoadIncrementalHFiles
> Running org.apache.hadoop.hbase.mapreduce.TestImportTSVWithVisibilityLabels
> Running org.apache.hadoop.hbase.mapreduce.TestImportTsv
> Tests run: 5, Failures: 0, Errors: 0, Skipped: 0, Time elapsed: 47.815 sec
> - in
> org.apache.hadoop.hbase.mapreduce.TestLoadIncrementalHFilesSplitRecovery
> Running org.apache.hadoop.hbase.mapreduce.TestTableMapReduce
> Tests run: 1, Failures: 0, Errors: 0, Skipped: 0, Time elapsed: 46.621 sec
> - in org.apache.hadoop.hbase.mapreduce.TestMultithreadedTableMapper
> Running org.apache.hadoop.hbase.mapreduce.TestMultiTableSnapshotInputFormat
> Tests run: 2, Failures: 0, Errors: 0, Skipped: 0, Time elapsed: 34.215 sec
> - in org.apache.hadoop.hbase.mapreduce.TestTableMapReduce
> Tests run: 4, Failures: 0, Errors: 0, Skipped: 0, Time elapsed: 33.734 sec
> - in org.apache.hadoop.hbase.mapreduce.TestMultiTableSnapshotInputFormat
> Tests run: 7, Failures: 0, Errors: 0, Skipped: 0, Time elapsed: 83.996 sec
> - in org.apache.hadoop.hbase.mapreduce.TestImportTSVWithVisibilityLabels
> Tests run: 17, Failures: 0, Errors: 0, Skipped: 0, Time elapsed: 134.253
> sec - in org.apache.hadoop.hbase.mapreduce.TestImportTsv
>
> Results :
>
> Tests run: 2476, Failures: 0, Errors: 0, Skipped: 35
>
> [INFO]
> ------------------------------------------------------------------------
> [INFO] Reactor Summary:
> [INFO]
> [INFO] Apache HBase ...................................... SUCCESS [
> 2.928 s]
> [INFO] Apache HBase - Checkstyle ......................... SUCCESS [
> 0.733 s]
> [INFO] Apache HBase - Resource Bundle .................... SUCCESS [
> 0.301 s]
> [INFO] Apache HBase - Annotations ........................ SUCCESS [
> 0.453 s]
> [INFO] Apache HBase - Protocol ........................... SUCCESS [
> 3.549 s]
> [INFO] Apache HBase - Common ............................. SUCCESS [01:32
> min]
> [INFO] Apache HBase - Procedure .......................... SUCCESS [02:23
> min]
> [INFO] Apache HBase - Client ............................. SUCCESS [
> 36.574 s]
> [INFO] Apache HBase - Hadoop Compatibility ............... SUCCESS [
> 7.911 s]
> [INFO] Apache HBase - Hadoop Two Compatibility ........... SUCCESS [
> 8.573 s]
> [INFO] Apache HBase - Prefix Tree ........................ SUCCESS [
> 11.204 s]
> [INFO] Apache HBase - Server ............................. FAILURE [
> 01:41 h]
> [INFO] Apache HBase - Testing Util ....................... SKIPPED
> [INFO] Apache HBase - Thrift ............................. SKIPPED
> [INFO] Apache HBase - Shell .............................. SKIPPED
> [INFO] Apache HBase - Integration Tests .................. SKIPPED
> [INFO] Apache HBase - Examples ........................... SKIPPED
> [INFO] Apache HBase - Rest ............................... SKIPPED
> [INFO] Apache HBase - External Block Cache ............... SKIPPED
> [INFO] Apache HBase - Assembly ........................... SKIPPED
> [INFO] Apache HBase - Shaded ............................. SKIPPED
> [INFO] Apache HBase - Shaded - Client .................... SKIPPED
> [INFO] Apache HBase - Shaded - Server .................... SKIPPED
> [INFO] Apache HBase - Spark .............................. SKIPPED
> [INFO]
> ------------------------------------------------------------------------
> [INFO] BUILD FAILURE
> [INFO]
> ------------------------------------------------------------------------
> [INFO] Total time: 01:46 h
> [INFO] Finished at: 2016-01-07T19:34:51+00:00
> [INFO] Final Memory: 65M/597M
> [INFO]
> ------------------------------------------------------------------------
> [ERROR] Failed to execute goal
> org.apache.maven.plugins:maven-surefire-plugin:2.18.1:test
> (secondPartTestsExecution) on project hbase-server: There was a timeout or
> other error in the fork -> [Help 1]
> [ERROR]
> [ERROR] To see the full stack trace of the errors, re-run Maven with the
> -e switch.
> [ERROR] Re-run Maven using the -X switch to enable full debug logging.
> [ERROR]
> [ERROR] For more information about the errors and possible solutions,
> please read the following articles:
> [ERROR] [Help 1]
> http://cwiki.apache.org/confluence/display/MAVEN/MojoFailureException
> [ERROR]
> [ERROR] After correcting the problems, you can resume the build with the
> command
> [ERROR]   mvn <goals> -rf :hbase-server
> Build step 'Invoke top-level Maven targets' marked build as failure
> Performing Post build task...
> Match found for :.* : True
> Logical operation result is TRUE
> Running script  : # Run zombie detector script
> ./dev-support/zombie-detector.sh --jenkins ${BUILD_ID}
> [Hadoop] $ /bin/bash -xe /tmp/hudson2419471294660970397.sh
> + ./dev-support/zombie-detector.sh --jenkins 618
> Thu Jan  7 19:34:54 UTC 2016 We're ok: there is no zombie test
>
>
>     {color:green}+1 zombies{color}. No zombie tests found running at the
> end of the build.
> POST BUILD TASK : SUCCESS
> END OF POST BUILD TASK : 0
> Archiving artifacts
> Recording test results
> [FINDBUGS] Skipping publisher since build result is FAILURE
> [CHECKSTYLE] Skipping publisher since build result is FAILURE
>

Mime
  • Unnamed multipart/alternative (inline, None, 0 bytes)
View raw message