hbase-dev mailing list archives

Site index · List index
Message view « Date » · « Thread »
Top « Date » · « Thread »
From Stack <st...@duboce.net>
Subject Re: Build failed in Jenkins: HBase-Trunk_matrix » latest1.7,Hadoop #578
Date Tue, 22 Dec 2015 18:14:29 GMT
This is a version of the flakey HBASE-14814

On Tue, Dec 22, 2015 at 10:09 AM, Apache Jenkins Server <
jenkins@builds.apache.org> wrote:

> See <
> https://builds.apache.org/job/HBase-Trunk_matrix/jdk=latest1.7,label=Hadoop/578/changes
> >
>
> Changes:
>
> [tedyu] HBASE-15028 Minor fix on RegionGroupingProvider (Yu Li)
>
> [stack] HBASE-14980 Project Astro; addendum
>
> ------------------------------------------
> [...truncated 3957 lines...]
> Tests run: 1, Failures: 0, Errors: 0, Skipped: 1, Time elapsed: 0.001 sec
> - in org.apache.hadoop.hbase.ipc.TestRpcHandlerException
> Running org.apache.hadoop.hbase.ipc.TestSimpleRpcScheduler
> Tests run: 4, Failures: 0, Errors: 0, Skipped: 0, Time elapsed: 6.486 sec
> - in org.apache.hadoop.hbase.ipc.TestSimpleRpcScheduler
> Running org.apache.hadoop.hbase.ipc.TestAsyncIPC
> Tests run: 28, Failures: 0, Errors: 0, Skipped: 0, Time elapsed: 4.836 sec
> - in org.apache.hadoop.hbase.ipc.TestAsyncIPC
> Running org.apache.hadoop.hbase.ipc.TestIPC
> Tests run: 5, Failures: 0, Errors: 0, Skipped: 0, Time elapsed: 2.204 sec
> - in org.apache.hadoop.hbase.ipc.TestIPC
> Running org.apache.hadoop.hbase.ipc.TestGlobalEventLoopGroup
> Tests run: 1, Failures: 0, Errors: 0, Skipped: 0, Time elapsed: 1.011 sec
> - in org.apache.hadoop.hbase.ipc.TestGlobalEventLoopGroup
> Running org.apache.hadoop.hbase.ipc.TestCallRunner
> Tests run: 1, Failures: 0, Errors: 0, Skipped: 0, Time elapsed: 0.6 sec -
> in org.apache.hadoop.hbase.ipc.TestCallRunner
> Running org.apache.hadoop.hbase.ipc.TestBufferChain
> Tests run: 5, Failures: 0, Errors: 0, Skipped: 0, Time elapsed: 0.627 sec
> - in org.apache.hadoop.hbase.ipc.TestBufferChain
> Running org.apache.hadoop.hbase.protobuf.TestProtobufUtil
> Tests run: 7, Failures: 0, Errors: 0, Skipped: 0, Time elapsed: 1.421 sec
> - in org.apache.hadoop.hbase.protobuf.TestProtobufUtil
> Running org.apache.hadoop.hbase.protobuf.TestReplicationProtobuf
> Tests run: 1, Failures: 0, Errors: 0, Skipped: 0, Time elapsed: 0.18 sec -
> in org.apache.hadoop.hbase.protobuf.TestReplicationProtobuf
> Running org.apache.hadoop.hbase.client.TestHBaseAdminNoCluster
> Tests run: 2, Failures: 0, Errors: 0, Skipped: 1, Time elapsed: 8.097 sec
> - in org.apache.hadoop.hbase.client.TestHBaseAdminNoCluster
> Running org.apache.hadoop.hbase.client.TestConnectionUtils
> Tests run: 1, Failures: 0, Errors: 0, Skipped: 0, Time elapsed: 0.191 sec
> - in org.apache.hadoop.hbase.client.TestConnectionUtils
> Running org.apache.hadoop.hbase.client.TestIntraRowPagination
> Tests run: 1, Failures: 0, Errors: 0, Skipped: 0, Time elapsed: 1.797 sec
> - in org.apache.hadoop.hbase.client.TestIntraRowPagination
> Running org.apache.hadoop.hbase.client.TestPutDeleteEtcCellIteration
> Tests run: 6, Failures: 0, Errors: 0, Skipped: 0, Time elapsed: 0.378 sec
> - in org.apache.hadoop.hbase.client.TestPutDeleteEtcCellIteration
> Running org.apache.hadoop.hbase.client.TestResult
> Tests run: 9, Failures: 0, Errors: 0, Skipped: 0, Time elapsed: 0.485 sec
> - in org.apache.hadoop.hbase.client.TestResult
> Running org.apache.hadoop.hbase.TestTableDescriptor
> Tests run: 1, Failures: 0, Errors: 0, Skipped: 0, Time elapsed: 1.246 sec
> - in org.apache.hadoop.hbase.TestTableDescriptor
> Running org.apache.hadoop.hbase.regionserver.TestRegionSplitPolicy
> Tests run: 7, Failures: 0, Errors: 0, Skipped: 0, Time elapsed: 1.661 sec
> - in org.apache.hadoop.hbase.regionserver.TestRegionSplitPolicy
> Running org.apache.hadoop.hbase.regionserver.TestBulkLoad
> Tests run: 9, Failures: 0, Errors: 0, Skipped: 0, Time elapsed: 2.385 sec
> - in org.apache.hadoop.hbase.regionserver.TestBulkLoad
> Running org.apache.hadoop.hbase.regionserver.TestRegionMergeTransaction
> Tests run: 11, Failures: 0, Errors: 0, Skipped: 0, Time elapsed: 15.9 sec
> - in org.apache.hadoop.hbase.regionserver.TestRegionMergeTransaction
> Running org.apache.hadoop.hbase.regionserver.TestStoreFileInfo
> Tests run: 2, Failures: 0, Errors: 0, Skipped: 0, Time elapsed: 0.594 sec
> - in org.apache.hadoop.hbase.regionserver.TestStoreFileInfo
> Running
> org.apache.hadoop.hbase.regionserver.TestStoreFileScannerWithTagCompression
> Tests run: 1, Failures: 0, Errors: 0, Skipped: 0, Time elapsed: 0.353 sec
> - in
> org.apache.hadoop.hbase.regionserver.TestStoreFileScannerWithTagCompression
> Running org.apache.hadoop.hbase.regionserver.TestHRegionInfo
> Tests run: 11, Failures: 0, Errors: 0, Skipped: 0, Time elapsed: 3.645 sec
> - in org.apache.hadoop.hbase.regionserver.TestHRegionInfo
> Running org.apache.hadoop.hbase.regionserver.TestStoreFileRefresherChore
> Tests run: 1, Failures: 0, Errors: 0, Skipped: 0, Time elapsed: 2.967 sec
> - in org.apache.hadoop.hbase.regionserver.TestStoreFileRefresherChore
> Running
> org.apache.hadoop.hbase.regionserver.compactions.TestStripeCompactionPolicy
> Tests run: 15, Failures: 0, Errors: 0, Skipped: 0, Time elapsed: 2.2 sec -
> in
> org.apache.hadoop.hbase.regionserver.compactions.TestStripeCompactionPolicy
> Running org.apache.hadoop.hbase.regionserver.compactions.TestOffPeakHours
> Tests run: 3, Failures: 0, Errors: 0, Skipped: 0, Time elapsed: 0.117 sec
> - in org.apache.hadoop.hbase.regionserver.compactions.TestOffPeakHours
> Running org.apache.hadoop.hbase.regionserver.TestStripeStoreFileManager
> Tests run: 15, Failures: 0, Errors: 0, Skipped: 0, Time elapsed: 3.32 sec
> - in org.apache.hadoop.hbase.regionserver.TestStripeStoreFileManager
> Running org.apache.hadoop.hbase.regionserver.TestMetricsRegion
> Tests run: 1, Failures: 0, Errors: 0, Skipped: 0, Time elapsed: 0.366 sec
> - in org.apache.hadoop.hbase.regionserver.TestMetricsRegion
> Running org.apache.hadoop.hbase.regionserver.TestDefaultStoreEngine
> Tests run: 1, Failures: 0, Errors: 0, Skipped: 0, Time elapsed: 0.948 sec
> - in org.apache.hadoop.hbase.regionserver.TestDefaultStoreEngine
> Running org.apache.hadoop.hbase.regionserver.TestResettingCounters
> Tests run: 1, Failures: 0, Errors: 0, Skipped: 0, Time elapsed: 2.508 sec
> - in org.apache.hadoop.hbase.regionserver.TestResettingCounters
> Running org.apache.hadoop.hbase.regionserver.TestScanWildcardColumnTracker
> Tests run: 2, Failures: 0, Errors: 0, Skipped: 0, Time elapsed: 0.15 sec -
> in org.apache.hadoop.hbase.regionserver.TestScanWildcardColumnTracker
> Running org.apache.hadoop.hbase.regionserver.TestQosFunction
> Tests run: 2, Failures: 0, Errors: 0, Skipped: 0, Time elapsed: 1.588 sec
> - in org.apache.hadoop.hbase.regionserver.TestQosFunction
> Running org.apache.hadoop.hbase.regionserver.TestRSStatusServlet
> Tests run: 2, Failures: 0, Errors: 0, Skipped: 0, Time elapsed: 0.924 sec
> - in org.apache.hadoop.hbase.regionserver.TestRSStatusServlet
> Running org.apache.hadoop.hbase.regionserver.TestQueryMatcher
> Tests run: 5, Failures: 0, Errors: 0, Skipped: 0, Time elapsed: 0.243 sec
> - in org.apache.hadoop.hbase.regionserver.TestQueryMatcher
> Running org.apache.hadoop.hbase.regionserver.TestDefaultCompactSelection
> Tests run: 4, Failures: 0, Errors: 0, Skipped: 0, Time elapsed: 1.792 sec
> - in org.apache.hadoop.hbase.regionserver.TestDefaultCompactSelection
> Running org.apache.hadoop.hbase.regionserver.TestScanner
> Tests run: 7, Failures: 0, Errors: 0, Skipped: 0, Time elapsed: 9.099 sec
> - in org.apache.hadoop.hbase.regionserver.TestScanner
> Running org.apache.hadoop.hbase.regionserver.TestMetricsRegionServer
> Tests run: 3, Failures: 0, Errors: 0, Skipped: 0, Time elapsed: 0.513 sec
> - in org.apache.hadoop.hbase.regionserver.TestMetricsRegionServer
> Running org.apache.hadoop.hbase.regionserver.TestScanWithBloomError
> Tests run: 3, Failures: 0, Errors: 0, Skipped: 0, Time elapsed: 2.112 sec
> - in org.apache.hadoop.hbase.regionserver.TestScanWithBloomError
> Running org.apache.hadoop.hbase.regionserver.TestKeepDeletes
> Tests run: 12, Failures: 0, Errors: 0, Skipped: 0, Time elapsed: 4.323 sec
> - in org.apache.hadoop.hbase.regionserver.TestKeepDeletes
> Running org.apache.hadoop.hbase.regionserver.TestBlocksScanned
> Tests run: 2, Failures: 0, Errors: 0, Skipped: 0, Time elapsed: 6.174 sec
> - in org.apache.hadoop.hbase.regionserver.TestBlocksScanned
> Running org.apache.hadoop.hbase.regionserver.TestStripeStoreEngine
> Tests run: 2, Failures: 0, Errors: 0, Skipped: 0, Time elapsed: 1.19 sec -
> in org.apache.hadoop.hbase.regionserver.TestStripeStoreEngine
> Running org.apache.hadoop.hbase.regionserver.TestHRegionFileSystem
> Tests run: 3, Failures: 0, Errors: 0, Skipped: 0, Time elapsed: 18.924 sec
> - in org.apache.hadoop.hbase.regionserver.TestHRegionFileSystem
> Running org.apache.hadoop.hbase.regionserver.wal.TestKeyValueCompression
> Tests run: 3, Failures: 0, Errors: 0, Skipped: 0, Time elapsed: 0.249 sec
> - in org.apache.hadoop.hbase.regionserver.wal.TestKeyValueCompression
> Running org.apache.hadoop.hbase.regionserver.wal.TestSequenceIdAccounting
> Tests run: 3, Failures: 0, Errors: 0, Skipped: 0, Time elapsed: 0.148 sec
> - in org.apache.hadoop.hbase.regionserver.wal.TestSequenceIdAccounting
> Running
> org.apache.hadoop.hbase.regionserver.wal.TestWALCellCodecWithCompression
> Tests run: 2, Failures: 0, Errors: 0, Skipped: 0, Time elapsed: 0.249 sec
> - in
> org.apache.hadoop.hbase.regionserver.wal.TestWALCellCodecWithCompression
> Running org.apache.hadoop.hbase.regionserver.wal.TestCustomWALCellCodec
> Tests run: 1, Failures: 0, Errors: 0, Skipped: 0, Time elapsed: 0.171 sec
> - in org.apache.hadoop.hbase.regionserver.wal.TestCustomWALCellCodec
> Running org.apache.hadoop.hbase.regionserver.wal.TestWALActionsListener
> Tests run: 1, Failures: 0, Errors: 0, Skipped: 0, Time elapsed: 0.436 sec
> - in org.apache.hadoop.hbase.regionserver.wal.TestWALActionsListener
> Running org.apache.hadoop.hbase.regionserver.wal.TestMetricsWAL
> Tests run: 3, Failures: 0, Errors: 0, Skipped: 0, Time elapsed: 0.662 sec
> - in org.apache.hadoop.hbase.regionserver.wal.TestMetricsWAL
> Running org.apache.hadoop.hbase.regionserver.wal.TestCompressor
> Tests run: 4, Failures: 0, Errors: 0, Skipped: 0, Time elapsed: 0.269 sec
> - in org.apache.hadoop.hbase.regionserver.wal.TestCompressor
> Running org.apache.hadoop.hbase.regionserver.TestMemStoreChunkPool
> Tests run: 3, Failures: 0, Errors: 0, Skipped: 0, Time elapsed: 0.363 sec
> - in org.apache.hadoop.hbase.regionserver.TestMemStoreChunkPool
> Running org.apache.hadoop.hbase.regionserver.TestStoreFile
> Tests run: 13, Failures: 0, Errors: 0, Skipped: 0, Time elapsed: 3.321 sec
> - in org.apache.hadoop.hbase.regionserver.TestStoreFile
> Running org.apache.hadoop.hbase.regionserver.TestStripeCompactor
> Tests run: 3, Failures: 0, Errors: 0, Skipped: 0, Time elapsed: 1.56 sec -
> in org.apache.hadoop.hbase.regionserver.TestStripeCompactor
> Running org.apache.hadoop.hbase.regionserver.TestCellSkipListSet
> Tests run: 4, Failures: 0, Errors: 0, Skipped: 0, Time elapsed: 0.203 sec
> - in org.apache.hadoop.hbase.regionserver.TestCellSkipListSet
> Running org.apache.hadoop.hbase.regionserver.TestTimeRangeTracker
> Tests run: 3, Failures: 0, Errors: 0, Skipped: 0, Time elapsed: 0.239 sec
> - in org.apache.hadoop.hbase.regionserver.TestTimeRangeTracker
> Running org.apache.hadoop.hbase.regionserver.TestMinVersions
> Tests run: 6, Failures: 0, Errors: 0, Skipped: 0, Time elapsed: 2.605 sec
> - in org.apache.hadoop.hbase.regionserver.TestMinVersions
> Running org.apache.hadoop.hbase.regionserver.TestServerNonceManager
> Tests run: 6, Failures: 0, Errors: 0, Skipped: 0, Time elapsed: 2.089 sec
> - in org.apache.hadoop.hbase.regionserver.TestServerNonceManager
> Running org.apache.hadoop.hbase.regionserver.TestSplitTransaction
> Tests run: 8, Failures: 0, Errors: 0, Skipped: 0, Time elapsed: 44.833 sec
> - in org.apache.hadoop.hbase.regionserver.TestSplitTransaction
> Running org.apache.hadoop.hbase.regionserver.TestKeyValueHeap
> Tests run: 4, Failures: 0, Errors: 0, Skipped: 0, Time elapsed: 0.192 sec
> - in org.apache.hadoop.hbase.regionserver.TestKeyValueHeap
> Running org.apache.hadoop.hbase.regionserver.TestKeyValueScanFixture
> Tests run: 1, Failures: 0, Errors: 0, Skipped: 0, Time elapsed: 0.195 sec
> - in org.apache.hadoop.hbase.regionserver.TestKeyValueScanFixture
> Running org.apache.hadoop.hbase.regionserver.TestScanDeleteTracker
> Tests run: 8, Failures: 0, Errors: 0, Skipped: 0, Time elapsed: 0.36 sec -
> in org.apache.hadoop.hbase.regionserver.TestScanDeleteTracker
> Running org.apache.hadoop.hbase.regionserver.TestExplicitColumnTracker
> Tests run: 4, Failures: 0, Errors: 0, Skipped: 0, Time elapsed: 0.609 sec
> - in org.apache.hadoop.hbase.regionserver.TestExplicitColumnTracker
> Running org.apache.hadoop.hbase.regionserver.TestHeapMemoryManager
> Tests run: 13, Failures: 0, Errors: 0, Skipped: 0, Time elapsed: 20.183
> sec - in org.apache.hadoop.hbase.regionserver.TestHeapMemoryManager
> Running org.apache.hadoop.hbase.regionserver.TestMemStoreLAB
> Tests run: 3, Failures: 0, Errors: 0, Skipped: 0, Time elapsed: 1.141 sec
> - in org.apache.hadoop.hbase.regionserver.TestMemStoreLAB
> Running org.apache.hadoop.hbase.regionserver.TestWideScanner
> Tests run: 1, Failures: 0, Errors: 0, Skipped: 0, Time elapsed: 4.197 sec
> - in org.apache.hadoop.hbase.regionserver.TestWideScanner
> Running
> org.apache.hadoop.hbase.regionserver.TestMiniBatchOperationInProgress
> Tests run: 1, Failures: 0, Errors: 0, Skipped: 0, Time elapsed: 0.179 sec
> - in org.apache.hadoop.hbase.regionserver.TestMiniBatchOperationInProgress
> Running
> org.apache.hadoop.hbase.regionserver.TestMultiVersionConcurrencyControlBasic
> Tests run: 1, Failures: 0, Errors: 0, Skipped: 0, Time elapsed: 0.145 sec
> - in
> org.apache.hadoop.hbase.regionserver.TestMultiVersionConcurrencyControlBasic
> Running org.apache.hadoop.hbase.TestFSTableDescriptorForceCreation
> Tests run: 3, Failures: 0, Errors: 0, Skipped: 0, Time elapsed: 0.945 sec
> - in org.apache.hadoop.hbase.TestFSTableDescriptorForceCreation
> Running org.apache.hadoop.hbase.quotas.TestQuotaState
> Tests run: 5, Failures: 0, Errors: 0, Skipped: 0, Time elapsed: 1.279 sec
> - in org.apache.hadoop.hbase.quotas.TestQuotaState
> Running org.apache.hadoop.hbase.quotas.TestRateLimiter
> Tests run: 12, Failures: 0, Errors: 0, Skipped: 0, Time elapsed: 0.525 sec
> - in org.apache.hadoop.hbase.quotas.TestRateLimiter
> Running
> org.apache.hadoop.hbase.monitoring.TestMemoryBoundedLogMessageBuffer
> Tests run: 2, Failures: 0, Errors: 0, Skipped: 0, Time elapsed: 0.208 sec
> - in org.apache.hadoop.hbase.monitoring.TestMemoryBoundedLogMessageBuffer
> Running org.apache.hadoop.hbase.monitoring.TestTaskMonitor
> Tests run: 3, Failures: 0, Errors: 0, Skipped: 0, Time elapsed: 0.543 sec
> - in org.apache.hadoop.hbase.monitoring.TestTaskMonitor
> Running org.apache.hadoop.hbase.constraint.TestConstraints
> Tests run: 6, Failures: 0, Errors: 0, Skipped: 0, Time elapsed: 1.486 sec
> - in org.apache.hadoop.hbase.constraint.TestConstraints
> Running org.apache.hadoop.hbase.http.TestPathFilter
> Tests run: 1, Failures: 0, Errors: 0, Skipped: 0, Time elapsed: 0.868 sec
> - in org.apache.hadoop.hbase.http.TestPathFilter
> Running org.apache.hadoop.hbase.http.TestHttpServerWebapps
> Tests run: 2, Failures: 0, Errors: 0, Skipped: 0, Time elapsed: 0.516 sec
> - in org.apache.hadoop.hbase.http.TestHttpServerWebapps
> Running org.apache.hadoop.hbase.http.TestHtmlQuoting
> Tests run: 4, Failures: 0, Errors: 0, Skipped: 0, Time elapsed: 0.464 sec
> - in org.apache.hadoop.hbase.http.TestHtmlQuoting
> Running org.apache.hadoop.hbase.http.conf.TestConfServlet
> Tests run: 3, Failures: 0, Errors: 0, Skipped: 0, Time elapsed: 0.767 sec
> - in org.apache.hadoop.hbase.http.conf.TestConfServlet
> Running org.apache.hadoop.hbase.http.TestHttpRequestLog
> Tests run: 2, Failures: 0, Errors: 0, Skipped: 0, Time elapsed: 0.185 sec
> - in org.apache.hadoop.hbase.http.TestHttpRequestLog
> Running org.apache.hadoop.hbase.http.TestHttpServerLifecycle
> Tests run: 6, Failures: 0, Errors: 0, Skipped: 6, Time elapsed: 0.002 sec
> - in org.apache.hadoop.hbase.http.TestHttpServerLifecycle
> Running org.apache.hadoop.hbase.http.TestGlobalFilter
> Tests run: 1, Failures: 0, Errors: 0, Skipped: 0, Time elapsed: 0.914 sec
> - in org.apache.hadoop.hbase.http.TestGlobalFilter
> Running org.apache.hadoop.hbase.http.jmx.TestJMXJsonServlet
> Tests run: 1, Failures: 0, Errors: 0, Skipped: 0, Time elapsed: 0.387 sec
> - in org.apache.hadoop.hbase.http.jmx.TestJMXJsonServlet
> Running org.apache.hadoop.hbase.http.TestHttpServer
> Tests run: 16, Failures: 1, Errors: 0, Skipped: 3, Time elapsed: 3.935 sec
> <<< FAILURE! - in org.apache.hadoop.hbase.http.TestHttpServer
> testBindAddress(org.apache.hadoop.hbase.http.TestHttpServer)  Time
> elapsed: 1.312 sec  <<< FAILURE!
> java.lang.AssertionError: null
>         at org.junit.Assert.fail(Assert.java:86)
>         at org.junit.Assert.assertTrue(Assert.java:41)
>         at org.junit.Assert.assertTrue(Assert.java:52)
>         at
> org.apache.hadoop.hbase.http.TestHttpServer.checkBindAddress(TestHttpServer.java:582)
>         at
> org.apache.hadoop.hbase.http.TestHttpServer.testBindAddress(TestHttpServer.java:545)
>
> Running org.apache.hadoop.hbase.http.TestHttpRequestLogAppender
> Tests run: 1, Failures: 0, Errors: 0, Skipped: 0, Time elapsed: 0.15 sec -
> in org.apache.hadoop.hbase.http.TestHttpRequestLogAppender
> Running org.apache.hadoop.hbase.http.log.TestLogLevel
> Tests run: 1, Failures: 0, Errors: 0, Skipped: 0, Time elapsed: 0.942 sec
> - in org.apache.hadoop.hbase.http.log.TestLogLevel
> Running org.apache.hadoop.hbase.http.TestServletFilter
> Tests run: 3, Failures: 0, Errors: 0, Skipped: 1, Time elapsed: 0.928 sec
> - in org.apache.hadoop.hbase.http.TestServletFilter
> Running org.apache.hadoop.hbase.http.TestSSLHttpServer
> Tests run: 1, Failures: 0, Errors: 0, Skipped: 0, Time elapsed: 0.369 sec
> - in org.apache.hadoop.hbase.http.TestSSLHttpServer
> Running org.apache.hadoop.hbase.http.lib.TestStaticUserWebFilter
> Tests run: 3, Failures: 0, Errors: 0, Skipped: 0, Time elapsed: 0.819 sec
> - in org.apache.hadoop.hbase.http.lib.TestStaticUserWebFilter
>
> Results :
>
> Failed tests:
>
> TestHttpServer.testBindAddress:545->checkBindAddress:582->Assert.assertTrue:52->Assert.assertTrue:41->Assert.fail:86
> null
>
> Tests run: 1033, Failures: 1, Errors: 0, Skipped: 21
>
> [INFO]
> ------------------------------------------------------------------------
> [INFO] Reactor Summary:
> [INFO]
> [INFO] Apache HBase ...................................... SUCCESS [
> 2.693 s]
> [INFO] Apache HBase - Checkstyle ......................... SUCCESS [
> 0.757 s]
> [INFO] Apache HBase - Resource Bundle .................... SUCCESS [
> 0.195 s]
> [INFO] Apache HBase - Annotations ........................ SUCCESS [
> 0.219 s]
> [INFO] Apache HBase - Protocol ........................... SUCCESS [
> 2.892 s]
> [INFO] Apache HBase - Common ............................. SUCCESS [01:32
> min]
> [INFO] Apache HBase - Procedure .......................... SUCCESS [02:19
> min]
> [INFO] Apache HBase - Client ............................. SUCCESS [
> 35.913 s]
> [INFO] Apache HBase - Hadoop Compatibility ............... SUCCESS [
> 7.587 s]
> [INFO] Apache HBase - Hadoop Two Compatibility ........... SUCCESS [
> 8.224 s]
> [INFO] Apache HBase - Prefix Tree ........................ SUCCESS [
> 10.724 s]
> [INFO] Apache HBase - Server ............................. FAILURE [15:43
> min]
> [INFO] Apache HBase - Testing Util ....................... SKIPPED
> [INFO] Apache HBase - Thrift ............................. SKIPPED
> [INFO] Apache HBase - Shell .............................. SKIPPED
> [INFO] Apache HBase - Integration Tests .................. SKIPPED
> [INFO] Apache HBase - Examples ........................... SKIPPED
> [INFO] Apache HBase - Rest ............................... SKIPPED
> [INFO] Apache HBase - External Block Cache ............... SKIPPED
> [INFO] Apache HBase - Assembly ........................... SKIPPED
> [INFO] Apache HBase - Shaded ............................. SKIPPED
> [INFO] Apache HBase - Shaded - Client .................... SKIPPED
> [INFO] Apache HBase - Shaded - Server .................... SKIPPED
> [INFO] Apache HBase - Spark .............................. SKIPPED
> [INFO]
> ------------------------------------------------------------------------
> [INFO] BUILD FAILURE
> [INFO]
> ------------------------------------------------------------------------
> [INFO] Total time: 20:47 min
> [INFO] Finished at: 2015-12-22T18:07:42+00:00
> [INFO] Final Memory: 65M/601M
> [INFO]
> ------------------------------------------------------------------------
> [ERROR] Failed to execute goal
> org.apache.maven.plugins:maven-surefire-plugin:2.18.1:test (default-test)
> on project hbase-server: There are test failures.
> [ERROR]
> [ERROR] Please refer to <
> https://builds.apache.org/job/HBase-Trunk_matrix/jdk=latest1.7,label=Hadoop/ws/hbase-server/target/surefire-reports>
> for the individual test results.
> [ERROR] -> [Help 1]
> [ERROR]
> [ERROR] To see the full stack trace of the errors, re-run Maven with the
> -e switch.
> [ERROR] Re-run Maven using the -X switch to enable full debug logging.
> [ERROR]
> [ERROR] For more information about the errors and possible solutions,
> please read the following articles:
> [ERROR] [Help 1]
> http://cwiki.apache.org/confluence/display/MAVEN/MojoFailureException
> [ERROR]
> [ERROR] After correcting the problems, you can resume the build with the
> command
> [ERROR]   mvn <goals> -rf :hbase-server
> Build step 'Invoke top-level Maven targets' marked build as failure
> Performing Post build task...
> Match found for :.* : True
> Logical operation result is TRUE
> Running script  : # Run zombie detector script
> ./dev-support/zombie-detector.sh --jenkins ${BUILD_ID}
> [Hadoop] $ /bin/bash -xe /tmp/hudson4144969509118241722.sh
> + ./dev-support/zombie-detector.sh --jenkins 578
> Tue Dec 22 18:07:43 UTC 2015 We're ok: there is no zombie test
>
>
>     {color:green}+1 zombies{color}. No zombie tests found running at the
> end of the build.
> POST BUILD TASK : SUCCESS
> END OF POST BUILD TASK : 0
> Archiving artifacts
> Compressed 73.42 MB of artifacts by 10.0% relative to #577
> Recording test results
> [FINDBUGS] Skipping publisher since build result is FAILURE
> [CHECKSTYLE] Skipping publisher since build result is FAILURE
>

Mime
  • Unnamed multipart/alternative (inline, None, 0 bytes)
View raw message