hbase-dev mailing list archives

Site index · List index
Message view « Date » · « Thread »
Top « Date » · « Thread »
From Stack <st...@duboce.net>
Subject Re: Build failed in Jenkins: HBase-1.2 » latest1.8,Hadoop #480
Date Tue, 29 Dec 2015 17:32:41 GMT
The below hung:

Hanging test : org.apache.hadoop.hbase.regionserver.TestHRegion

St.Ack

On Tue, Dec 29, 2015 at 9:28 AM, Apache Jenkins Server <
jenkins@builds.apache.org> wrote:

> See <
> https://builds.apache.org/job/HBase-1.2/jdk=latest1.8,label=Hadoop/480/changes
> >
>
> Changes:
>
> [tedyu] HBASE-14867 SimpleRegionNormalizer needs to have better heuristics
> to
>
> ------------------------------------------
> [...truncated 45955 lines...]
> Java HotSpot(TM) 64-Bit Server VM warning: ignoring option
> MaxPermSize=256m; support was removed in 8.0
> Running org.apache.hadoop.hbase.TestInfoServers
> Java HotSpot(TM) 64-Bit Server VM warning: ignoring option
> MaxPermSize=256m; support was removed in 8.0
> Tests run: 3, Failures: 0, Errors: 0, Skipped: 0, Time elapsed: 3.6 sec -
> in org.apache.hadoop.hbase.TestInfoServers
> Java HotSpot(TM) 64-Bit Server VM warning: ignoring option
> MaxPermSize=256m; support was removed in 8.0
> Running org.apache.hadoop.hbase.filter.TestMultiRowRangeFilter
> Running org.apache.hadoop.hbase.filter.TestScanRowPrefix
> Tests run: 1, Failures: 0, Errors: 0, Skipped: 0, Time elapsed: 5.556 sec
> - in org.apache.hadoop.hbase.filter.TestScanRowPrefix
> Java HotSpot(TM) 64-Bit Server VM warning: ignoring option
> MaxPermSize=256m; support was removed in 8.0
> Java HotSpot(TM) 64-Bit Server VM warning: ignoring option
> MaxPermSize=256m; support was removed in 8.0
> Java HotSpot(TM) 64-Bit Server VM warning: ignoring option
> MaxPermSize=256m; support was removed in 8.0
> Java HotSpot(TM) 64-Bit Server VM warning: ignoring option
> MaxPermSize=256m; support was removed in 8.0
> Tests run: 20, Failures: 0, Errors: 0, Skipped: 0, Time elapsed: 22.965
> sec - in org.apache.hadoop.hbase.filter.TestMultiRowRangeFilter
> Running org.apache.hadoop.hbase.filter.TestFilterWrapper
> Java HotSpot(TM) 64-Bit Server VM warning: ignoring option
> MaxPermSize=256m; support was removed in 8.0
> Java HotSpot(TM) 64-Bit Server VM warning: ignoring option
> MaxPermSize=256m; support was removed in 8.0
> Java HotSpot(TM) 64-Bit Server VM warning: ignoring option
> MaxPermSize=256m; support was removed in 8.0
> Java HotSpot(TM) 64-Bit Server VM warning: ignoring option
> MaxPermSize=256m; support was removed in 8.0
> Tests run: 1, Failures: 0, Errors: 0, Skipped: 0, Time elapsed: 4.628 sec
> - in org.apache.hadoop.hbase.filter.TestFilterWrapper
> Java HotSpot(TM) 64-Bit Server VM warning: ignoring option
> MaxPermSize=256m; support was removed in 8.0
> Java HotSpot(TM) 64-Bit Server VM warning: ignoring option
> MaxPermSize=256m; support was removed in 8.0
> Java HotSpot(TM) 64-Bit Server VM warning: ignoring option
> MaxPermSize=256m; support was removed in 8.0
> Running org.apache.hadoop.hbase.filter.TestFuzzyRowFilterEndToEnd
> Tests run: 12, Failures: 0, Errors: 0, Skipped: 1, Time elapsed: 96.137
> sec - in org.apache.hadoop.hbase.namespace.TestNamespaceAuditor
> Java HotSpot(TM) 64-Bit Server VM warning: ignoring option
> MaxPermSize=256m; support was removed in 8.0
> Java HotSpot(TM) 64-Bit Server VM warning: ignoring option
> MaxPermSize=256m; support was removed in 8.0
> Java HotSpot(TM) 64-Bit Server VM warning: ignoring option
> MaxPermSize=256m; support was removed in 8.0
> Running org.apache.hadoop.hbase.filter.TestFuzzyRowAndColumnRangeFilter
> Tests run: 2, Failures: 0, Errors: 0, Skipped: 0, Time elapsed: 62.66 sec
> - in org.apache.hadoop.hbase.TestRegionRebalancing
> Java HotSpot(TM) 64-Bit Server VM warning: ignoring option
> MaxPermSize=256m; support was removed in 8.0
> Tests run: 1, Failures: 0, Errors: 0, Skipped: 0, Time elapsed: 4.758 sec
> - in org.apache.hadoop.hbase.filter.TestFuzzyRowAndColumnRangeFilter
> Java HotSpot(TM) 64-Bit Server VM warning: ignoring option
> MaxPermSize=256m; support was removed in 8.0
> Java HotSpot(TM) 64-Bit Server VM warning: ignoring option
> MaxPermSize=256m; support was removed in 8.0
> Java HotSpot(TM) 64-Bit Server VM warning: ignoring option
> MaxPermSize=256m; support was removed in 8.0
> Java HotSpot(TM) 64-Bit Server VM warning: ignoring option
> MaxPermSize=256m; support was removed in 8.0
> Java HotSpot(TM) 64-Bit Server VM warning: ignoring option
> MaxPermSize=256m; support was removed in 8.0
> Java HotSpot(TM) 64-Bit Server VM warning: ignoring option
> MaxPermSize=256m; support was removed in 8.0
> Java HotSpot(TM) 64-Bit Server VM warning: ignoring option
> MaxPermSize=256m; support was removed in 8.0
> Java HotSpot(TM) 64-Bit Server VM warning: ignoring option
> MaxPermSize=256m; support was removed in 8.0
> Java HotSpot(TM) 64-Bit Server VM warning: ignoring option
> MaxPermSize=256m; support was removed in 8.0
> Java HotSpot(TM) 64-Bit Server VM warning: ignoring option
> MaxPermSize=256m; support was removed in 8.0
> Running org.apache.hadoop.hbase.filter.TestColumnRangeFilter
> Running org.apache.hadoop.hbase.io.TestFileLink
> Running org.apache.hadoop.hbase.filter.TestFilterWithScanLimits
> Tests run: 1, Failures: 0, Errors: 0, Skipped: 0, Time elapsed: 8.094 sec
> - in org.apache.hadoop.hbase.filter.TestColumnRangeFilter
> Java HotSpot(TM) 64-Bit Server VM warning: ignoring option
> MaxPermSize=256m; support was removed in 8.0
> Tests run: 1, Failures: 0, Errors: 0, Skipped: 0, Time elapsed: 3.961 sec
> - in org.apache.hadoop.hbase.filter.TestFilterWithScanLimits
> Java HotSpot(TM) 64-Bit Server VM warning: ignoring option
> MaxPermSize=256m; support was removed in 8.0
> Java HotSpot(TM) 64-Bit Server VM warning: ignoring option
> MaxPermSize=256m; support was removed in 8.0
> Running org.apache.hadoop.hbase.io.hfile.TestScannerSelectionUsingTTL
> Running org.apache.hadoop.hbase.io.hfile.TestCacheConfig
> Tests run: 6, Failures: 0, Errors: 0, Skipped: 0, Time elapsed: 2.396 sec
> - in org.apache.hadoop.hbase.io.hfile.TestCacheConfig
> Java HotSpot(TM) 64-Bit Server VM warning: ignoring option
> MaxPermSize=256m; support was removed in 8.0
> Running org.apache.hadoop.hbase.io.hfile.TestHFileSeek
> Tests run: 1, Failures: 0, Errors: 0, Skipped: 0, Time elapsed: 1.982 sec
> - in org.apache.hadoop.hbase.io.hfile.TestHFileSeek
> Java HotSpot(TM) 64-Bit Server VM warning: ignoring option
> MaxPermSize=256m; support was removed in 8.0
> Tests run: 5, Failures: 0, Errors: 0, Skipped: 0, Time elapsed: 16.424 sec
> - in org.apache.hadoop.hbase.io.TestFileLink
> Java HotSpot(TM) 64-Bit Server VM warning: ignoring option
> MaxPermSize=256m; support was removed in 8.0
> Running org.apache.hadoop.hbase.io.hfile.TestSeekBeforeWithInlineBlocks
> Java HotSpot(TM) 64-Bit Server VM warning: ignoring option
> MaxPermSize=256m; support was removed in 8.0
> Running org.apache.hadoop.hbase.io.hfile.TestForceCacheImportantBlocks
> Tests run: 1, Failures: 0, Errors: 0, Skipped: 0, Time elapsed: 14.122 sec
> - in org.apache.hadoop.hbase.io.hfile.TestSeekBeforeWithInlineBlocks
> Java HotSpot(TM) 64-Bit Server VM warning: ignoring option
> MaxPermSize=256m; support was removed in 8.0
> Java HotSpot(TM) 64-Bit Server VM warning: ignoring option
> MaxPermSize=256m; support was removed in 8.0
> Running org.apache.hadoop.hbase.io.hfile.TestCacheOnWrite
> Tests run: 4, Failures: 0, Errors: 0, Skipped: 0, Time elapsed: 40.521 sec
> - in org.apache.hadoop.hbase.io.hfile.TestForceCacheImportantBlocks
> Java HotSpot(TM) 64-Bit Server VM warning: ignoring option
> MaxPermSize=256m; support was removed in 8.0
> Java HotSpot(TM) 64-Bit Server VM warning: ignoring option
> MaxPermSize=256m; support was removed in 8.0
> Java HotSpot(TM) 64-Bit Server VM warning: ignoring option
> MaxPermSize=256m; support was removed in 8.0
> Java HotSpot(TM) 64-Bit Server VM warning: ignoring option
> MaxPermSize=256m; support was removed in 8.0
> Java HotSpot(TM) 64-Bit Server VM warning: ignoring option
> MaxPermSize=256m; support was removed in 8.0
> Running org.apache.hadoop.hbase.io.hfile.TestHFileBlock
> Tests run: 6, Failures: 0, Errors: 0, Skipped: 0, Time elapsed: 64.213 sec
> - in org.apache.hadoop.hbase.io.hfile.TestScannerSelectionUsingTTL
> Java HotSpot(TM) 64-Bit Server VM warning: ignoring option
> MaxPermSize=256m; support was removed in 8.0
> Java HotSpot(TM) 64-Bit Server VM warning: ignoring option
> MaxPermSize=256m; support was removed in 8.0
> Java HotSpot(TM) 64-Bit Server VM warning: ignoring option
> MaxPermSize=256m; support was removed in 8.0
> Java HotSpot(TM) 64-Bit Server VM warning: ignoring option
> MaxPermSize=256m; support was removed in 8.0
> Java HotSpot(TM) 64-Bit Server VM warning: ignoring option
> MaxPermSize=256m; support was removed in 8.0
> Java HotSpot(TM) 64-Bit Server VM warning: ignoring option
> MaxPermSize=256m; support was removed in 8.0
> Java HotSpot(TM) 64-Bit Server VM warning: ignoring option
> MaxPermSize=256m; support was removed in 8.0
> Java HotSpot(TM) 64-Bit Server VM warning: ignoring option
> MaxPermSize=256m; support was removed in 8.0
> Java HotSpot(TM) 64-Bit Server VM warning: ignoring option
> MaxPermSize=256m; support was removed in 8.0
> Java HotSpot(TM) 64-Bit Server VM warning: ignoring option
> MaxPermSize=256m; support was removed in 8.0
> Java HotSpot(TM) 64-Bit Server VM warning: ignoring option
> MaxPermSize=256m; support was removed in 8.0
> Running org.apache.hadoop.hbase.io.hfile.TestHFileBlockIndex
> Tests run: 10, Failures: 0, Errors: 0, Skipped: 0, Time elapsed: 12.946
> sec - in org.apache.hadoop.hbase.io.hfile.TestHFileBlockIndex
> Java HotSpot(TM) 64-Bit Server VM warning: ignoring option
> MaxPermSize=256m; support was removed in 8.0
> Java HotSpot(TM) 64-Bit Server VM warning: ignoring option
> MaxPermSize=256m; support was removed in 8.0
> Java HotSpot(TM) 64-Bit Server VM warning: ignoring option
> MaxPermSize=256m; support was removed in 8.0
> Java HotSpot(TM) 64-Bit Server VM warning: ignoring option
> MaxPermSize=256m; support was removed in 8.0
> Java HotSpot(TM) 64-Bit Server VM warning: ignoring option
> MaxPermSize=256m; support was removed in 8.0
> Java HotSpot(TM) 64-Bit Server VM warning: ignoring option
> MaxPermSize=256m; support was removed in 8.0
> Java HotSpot(TM) 64-Bit Server VM warning: ignoring option
> MaxPermSize=256m; support was removed in 8.0
> Java HotSpot(TM) 64-Bit Server VM warning: ignoring option
> MaxPermSize=256m; support was removed in 8.0
> Java HotSpot(TM) 64-Bit Server VM warning: ignoring option
> MaxPermSize=256m; support was removed in 8.0
> Java HotSpot(TM) 64-Bit Server VM warning: ignoring option
> MaxPermSize=256m; support was removed in 8.0
> Running org.apache.hadoop.hbase.io.encoding.TestLoadAndSwitchEncodeOnDisk
> Tests run: 1, Failures: 0, Errors: 0, Skipped: 0, Time elapsed: 32.578 sec
> - in org.apache.hadoop.hbase.io.encoding.TestLoadAndSwitchEncodeOnDisk
> Java HotSpot(TM) 64-Bit Server VM warning: ignoring option
> MaxPermSize=256m; support was removed in 8.0
> Tests run: 51, Failures: 0, Errors: 0, Skipped: 1, Time elapsed: 345.974
> sec - in org.apache.hadoop.hbase.util.TestHBaseFsck
> Java HotSpot(TM) 64-Bit Server VM warning: ignoring option
> MaxPermSize=256m; support was removed in 8.0
> Java HotSpot(TM) 64-Bit Server VM warning: ignoring option
> MaxPermSize=256m; support was removed in 8.0
> Java HotSpot(TM) 64-Bit Server VM warning: ignoring option
> MaxPermSize=256m; support was removed in 8.0
> Running org.apache.hadoop.hbase.io.encoding.TestBufferedDataBlockEncoder
> Running org.apache.hadoop.hbase.io.encoding.TestEncodedSeekers
> Tests run: 28, Failures: 0, Errors: 0, Skipped: 0, Time elapsed: 93.973
> sec - in org.apache.hadoop.hbase.io.hfile.TestHFileBlock
> Java HotSpot(TM) 64-Bit Server VM warning: ignoring option
> MaxPermSize=256m; support was removed in 8.0
> Running org.apache.hadoop.hbase.io.encoding.TestDataBlockEncoders
> Tests run: 1, Failures: 0, Errors: 0, Skipped: 0, Time elapsed: 19.489 sec
> - in org.apache.hadoop.hbase.io.encoding.TestBufferedDataBlockEncoder
> Java HotSpot(TM) 64-Bit Server VM warning: ignoring option
> MaxPermSize=256m; support was removed in 8.0
> Java HotSpot(TM) 64-Bit Server VM warning: ignoring option
> MaxPermSize=256m; support was removed in 8.0
> Running org.apache.hadoop.hbase.io.encoding.TestChangingEncoding
> Tests run: 72, Failures: 0, Errors: 0, Skipped: 0, Time elapsed: 161.222
> sec - in org.apache.hadoop.hbase.io.hfile.TestCacheOnWrite
> Java HotSpot(TM) 64-Bit Server VM warning: ignoring option
> MaxPermSize=256m; support was removed in 8.0
> Java HotSpot(TM) 64-Bit Server VM warning: ignoring option
> MaxPermSize=256m; support was removed in 8.0
> Java HotSpot(TM) 64-Bit Server VM warning: ignoring option
> MaxPermSize=256m; support was removed in 8.0
> Java HotSpot(TM) 64-Bit Server VM warning: ignoring option
> MaxPermSize=256m; support was removed in 8.0
> Running org.apache.hadoop.hbase.TestClusterBootOrder
> Tests run: 3, Failures: 0, Errors: 0, Skipped: 0, Time elapsed: 222.204
> sec - in org.apache.hadoop.hbase.filter.TestFuzzyRowFilterEndToEnd
> Tests run: 28, Failures: 0, Errors: 0, Skipped: 0, Time elapsed: 51.794
> sec - in org.apache.hadoop.hbase.io.encoding.TestDataBlockEncoders
> Tests run: 2, Failures: 0, Errors: 0, Skipped: 0, Time elapsed: 29.604 sec
> - in org.apache.hadoop.hbase.TestClusterBootOrder
> Tests run: 20, Failures: 0, Errors: 0, Skipped: 0, Time elapsed: 136.539
> sec - in org.apache.hadoop.hbase.io.encoding.TestEncodedSeekers
> Tests run: 3, Failures: 0, Errors: 0, Skipped: 0, Time elapsed: 143.502
> sec - in org.apache.hadoop.hbase.io.encoding.TestChangingEncoding
>
> Results :
>
> Flaked tests:
>
> org.apache.hadoop.hbase.regionserver.TestSplitWalDataLoss.test(org.apache.hadoop.hbase.regionserver.TestSplitWalDataLoss)
>   Run 1: TestSplitWalDataLoss.test:124 » RetriesExhaustedWithDetails
> Failed 1 action: T...
>   Run 2: PASS
>
>
> Tests run: 2275, Failures: 0, Errors: 0, Skipped: 40, Flakes: 1
>
> [INFO]
> ------------------------------------------------------------------------
> [INFO] Reactor Summary:
> [INFO]
> [INFO] Apache HBase ...................................... SUCCESS
> [1:03.053s]
> [INFO] Apache HBase - Checkstyle ......................... SUCCESS [5.679s]
> [INFO] Apache HBase - Resource Bundle .................... SUCCESS [0.253s]
> [INFO] Apache HBase - Annotations ........................ SUCCESS [1.389s]
> [INFO] Apache HBase - Protocol ........................... SUCCESS
> [19.326s]
> [INFO] Apache HBase - Common ............................. SUCCESS
> [2:49.829s]
> [INFO] Apache HBase - Procedure .......................... SUCCESS
> [3:27.752s]
> [INFO] Apache HBase - Client ............................. SUCCESS
> [1:27.884s]
> [INFO] Apache HBase - Hadoop Compatibility ............... SUCCESS [8.333s]
> [INFO] Apache HBase - Hadoop Two Compatibility ........... SUCCESS [8.804s]
> [INFO] Apache HBase - Prefix Tree ........................ SUCCESS [9.225s]
> [INFO] Apache HBase - Server ............................. FAILURE
> [1:21:18.695s]
> [INFO] Apache HBase - Testing Util ....................... SKIPPED
> [INFO] Apache HBase - Thrift ............................. SKIPPED
> [INFO] Apache HBase - Rest ............................... SKIPPED
> [INFO] Apache HBase - Shell .............................. SKIPPED
> [INFO] Apache HBase - Integration Tests .................. SKIPPED
> [INFO] Apache HBase - Examples ........................... SKIPPED
> [INFO] Apache HBase - External Block Cache ............... SKIPPED
> [INFO] Apache HBase - Assembly ........................... SKIPPED
> [INFO] Apache HBase - Shaded ............................. SKIPPED
> [INFO] Apache HBase - Shaded - Client .................... SKIPPED
> [INFO] Apache HBase - Shaded - Server .................... SKIPPED
> [INFO]
> ------------------------------------------------------------------------
> [INFO] BUILD FAILURE
> [INFO]
> ------------------------------------------------------------------------
> [INFO] Total time: 1:31:19.256s
> [INFO] Finished at: Tue Dec 29 17:22:10 UTC 2015
> [INFO] Final Memory: 434M/666M
> [INFO]
> ------------------------------------------------------------------------
> [ERROR] Failed to execute goal
> org.apache.maven.plugins:maven-surefire-plugin:2.18.1:test
> (secondPartTestsExecution) on project hbase-server: There was a timeout or
> other error in the fork -> [Help 1]
> [ERROR]
> [ERROR] To see the full stack trace of the errors, re-run Maven with the
> -e switch.
> [ERROR] Re-run Maven using the -X switch to enable full debug logging.
> [ERROR]
> [ERROR] For more information about the errors and possible solutions,
> please read the following articles:
> [ERROR] [Help 1]
> http://cwiki.apache.org/confluence/display/MAVEN/MojoFailureException
> [ERROR]
> [ERROR] After correcting the problems, you can resume the build with the
> command
> [ERROR]   mvn <goals> -rf :hbase-server
> Build step 'Invoke top-level Maven targets' marked build as failure
> Performing Post build task...
> Match found for :.* : True
> Logical operation result is TRUE
> Running script  : # Post-build task script. TODO: Check this in and have
> all builds reference check-in.
> pwd && ls
> # NOTE!!!! The below code has been copied and pasted from
> ./dev-tools/run-test.sh
> # Do not change here without syncing there and vice-versa.
> ZOMBIE_TESTS_COUNT=`jps -v | grep surefirebooter | grep -e '-Dhbase.test'
> | wc -l`
> if [[ $ZOMBIE_TESTS_COUNT != 0 ]] ; then
>  echo "Suspicious java process found - waiting 30s to see if there are
> just slow to stop"
>  sleep 30
>  ZOMBIE_TESTS_COUNT=`jps -v | grep surefirebooter | grep -e '-Dhbase.test'
> | wc -l`
>  if [[ $ZOMBIE_TESTS_COUNT != 0 ]] ; then
>    echo " {color:red}There appear to be $ZOMBIE_TESTS_COUNT zombie
> tests{color}, they should have been killed by surefire but survived"
>    jps -v | grep surefirebooter | grep -e '-Dhbase.test'
>    jps -v | grep surefirebooter | grep -e '-Dhbase.test' | cut -d ' ' -f 1
> | xargs -n 1 jstack
>    # Exit with error
>    exit 1
>  else
>    echo "We're ok: there is no zombie test, but some tests took some time
> to stop"
>  fi
> else
>   echo "We're ok: there is no zombie test"
> fi
> [Hadoop] $ /bin/bash -xe /tmp/hudson6281252859512781066.sh
> + pwd
> <https://builds.apache.org/job/HBase-1.2/jdk=latest1.8,label=Hadoop/ws/>
> + ls
> bin
> CHANGES.txt
> conf
> dev-support
> hbase-annotations
> hbase-assembly
> hbase-checkstyle
> hbase-client
> hbase-common
> hbase-examples
> hbase-external-blockcache
> hbase-hadoop2-compat
> hbase-hadoop-compat
> hbase-it
> hbase-native-client
> hbase-prefix-tree
> hbase-procedure
> hbase-protocol
> hbase-resource-bundle
> hbase-rest
> hbase-server
> hbase-shaded
> hbase-shell
> hbase-testing-util
> hbase-thrift
> LICENSE.txt
> NOTICE.txt
> pom.xml
> README.txt
> src
> target
> ++ jps -v
> ++ grep surefirebooter
> ++ grep -e -Dhbase.test
> ++ wc -l
> + ZOMBIE_TESTS_COUNT=0
> + [[ 0 != 0 ]]
> + echo 'We'\''re ok: there is no zombie test'
> We're ok: there is no zombie test
> POST BUILD TASK : SUCCESS
> END OF POST BUILD TASK : 0
> Archiving artifacts
> Recording test results
>

Mime
  • Unnamed multipart/alternative (inline, None, 0 bytes)
View raw message