hbase-dev mailing list archives

Site index · List index
Message view « Date » · « Thread »
Top « Date » · « Thread »
From Stack <st...@duboce.net>
Subject Re: Build failed in Jenkins: HBase-1.3 » latest1.8,Hadoop #446
Date Thu, 17 Dec 2015 23:31:38 GMT
Something has gone badly wrong:

kalashnikov:hbase.git.commit stack$ python
./dev-support/findHangingTests.py
https://builds.apache.org/job/HBase-1.3/jdk=latest1.8,label=Hadoop/446/consoleText
Fetching
https://builds.apache.org/job/HBase-1.3/jdk=latest1.8,label=Hadoop/446/consoleText
Building remotely on H9 (Mapreduce Falcon Hadoop Pig Zookeeper Tez Hdfs) in
workspace
/home/jenkins/jenkins-slave/workspace/HBase-1.3/jdk/latest1.8/label/Hadoop
Printing hanging tests
Hanging test :
org.apache.hadoop.hbase.mapreduce.TestImportTSVWithOperationAttributes
Hanging test : org.apache.hadoop.hbase.mapreduce.TestRowCounter
Hanging test :
org.apache.hadoop.hbase.mapreduce.TestTableSnapshotInputFormat
Hanging test : org.apache.hadoop.hbase.mapreduce.TestImportTsv
Hanging test : org.apache.hadoop.hbase.mapreduce.TestImportExport
Hanging test : org.apache.hadoop.hbase.snapshot.TestSecureExportSnapshot
Hanging test : org.apache.hadoop.hbase.mapreduce.TestHFileOutputFormat
Hanging test : org.apache.hadoop.hbase.master.TestSplitLogManager
Hanging test :
org.apache.hadoop.hbase.mapreduce.TestMultiTableSnapshotInputFormat
Hanging test : org.apache.hadoop.hbase.snapshot.TestExportSnapshot
Printing Failing tests
Failing test : org.apache.hadoop.hbase.client.TestAdmin1

On Thu, Dec 17, 2015 at 2:11 PM, Apache Jenkins Server <
jenkins@builds.apache.org> wrote:

> See <
> https://builds.apache.org/job/HBase-1.3/jdk=latest1.8,label=Hadoop/446/changes
> >
>
> Changes:
>
> [anoopsamjohn] HBASE-15000 Fix javadoc warn in LoadIncrementalHFiles.
> (Ashish)
>
> ------------------------------------------
> [...truncated 46195 lines...]
> Java HotSpot(TM) 64-Bit Server VM warning: ignoring option
> MaxPermSize=256m; support was removed in 8.0
> Running org.apache.hadoop.hbase.filter.TestScanRowPrefix
> Java HotSpot(TM) 64-Bit Server VM warning: ignoring option
> MaxPermSize=256m; support was removed in 8.0
> Java HotSpot(TM) 64-Bit Server VM warning: ignoring option
> MaxPermSize=256m; support was removed in 8.0
> Tests run: 1, Failures: 0, Errors: 0, Skipped: 0, Time elapsed: 156.43 sec
> - in org.apache.hadoop.hbase.replication.TestReplicationKillSlaveRS
> Java HotSpot(TM) 64-Bit Server VM warning: ignoring option
> MaxPermSize=256m; support was removed in 8.0
> Java HotSpot(TM) 64-Bit Server VM warning: ignoring option
> MaxPermSize=256m; support was removed in 8.0
> Java HotSpot(TM) 64-Bit Server VM warning: ignoring option
> MaxPermSize=256m; support was removed in 8.0
> Tests run: 1, Failures: 0, Errors: 0, Skipped: 0, Time elapsed: 14.044 sec
> - in org.apache.hadoop.hbase.filter.TestScanRowPrefix
> Java HotSpot(TM) 64-Bit Server VM warning: ignoring option
> MaxPermSize=256m; support was removed in 8.0
> Java HotSpot(TM) 64-Bit Server VM warning: ignoring option
> MaxPermSize=256m; support was removed in 8.0
> Java HotSpot(TM) 64-Bit Server VM warning: ignoring option
> MaxPermSize=256m; support was removed in 8.0
> Java HotSpot(TM) 64-Bit Server VM warning: ignoring option
> MaxPermSize=256m; support was removed in 8.0
> Running org.apache.hadoop.hbase.filter.TestColumnRangeFilter
> Java HotSpot(TM) 64-Bit Server VM warning: ignoring option
> MaxPermSize=256m; support was removed in 8.0
> Java HotSpot(TM) 64-Bit Server VM warning: ignoring option
> MaxPermSize=256m; support was removed in 8.0
> Java HotSpot(TM) 64-Bit Server VM warning: ignoring option
> MaxPermSize=256m; support was removed in 8.0
> Java HotSpot(TM) 64-Bit Server VM warning: ignoring option
> MaxPermSize=256m; support was removed in 8.0
> Tests run: 1, Failures: 0, Errors: 0, Skipped: 0, Time elapsed: 29.655 sec
> - in org.apache.hadoop.hbase.filter.TestColumnRangeFilter
> Java HotSpot(TM) 64-Bit Server VM warning: ignoring option
> MaxPermSize=256m; support was removed in 8.0
> Running org.apache.hadoop.hbase.filter.TestFuzzyRowFilterEndToEnd
> Running org.apache.hadoop.hbase.filter.TestFilterWrapper
> Java HotSpot(TM) 64-Bit Server VM warning: ignoring option
> MaxPermSize=256m; support was removed in 8.0
> Running org.apache.hadoop.hbase.mapreduce.TestHFileOutputFormat
> Tests run: 1, Failures: 0, Errors: 0, Skipped: 0, Time elapsed: 9.141 sec
> - in org.apache.hadoop.hbase.filter.TestFilterWrapper
> Java HotSpot(TM) 64-Bit Server VM warning: ignoring option
> MaxPermSize=256m; support was removed in 8.0
> Running org.apache.hadoop.hbase.filter.TestMultiRowRangeFilter
> Running
> org.apache.hadoop.hbase.mapreduce.TestLoadIncrementalHFilesUseSecurityEndPoint
> Tests run: 20, Failures: 0, Errors: 0, Skipped: 0, Time elapsed: 49.705
> sec - in org.apache.hadoop.hbase.filter.TestMultiRowRangeFilter
> Java HotSpot(TM) 64-Bit Server VM warning: ignoring option
> MaxPermSize=256m; support was removed in 8.0
> Running org.apache.hadoop.hbase.mapreduce.TestWALPlayer
> Running org.apache.hadoop.hbase.mapreduce.TestHLogRecordReader
> Tests run: 2, Failures: 0, Errors: 0, Skipped: 0, Time elapsed: 6.431 sec
> - in org.apache.hadoop.hbase.mapreduce.TestHLogRecordReader
> Java HotSpot(TM) 64-Bit Server VM warning: ignoring option
> MaxPermSize=256m; support was removed in 8.0
> Running org.apache.hadoop.hbase.mapreduce.TestMultiTableInputFormat
> Tests run: 4, Failures: 0, Errors: 0, Skipped: 0, Time elapsed: 159.304
> sec - in org.apache.hadoop.hbase.mapreduce.TestWALPlayer
> Java HotSpot(TM) 64-Bit Server VM warning: ignoring option
> MaxPermSize=256m; support was removed in 8.0
> Running org.apache.hadoop.hbase.mapreduce.TestHashTable
> Tests run: 3, Failures: 0, Errors: 0, Skipped: 0, Time elapsed: 377.608
> sec - in org.apache.hadoop.hbase.filter.TestFuzzyRowFilterEndToEnd
> Java HotSpot(TM) 64-Bit Server VM warning: ignoring option
> MaxPermSize=256m; support was removed in 8.0
> Running
> org.apache.hadoop.hbase.mapreduce.TestImportTSVWithOperationAttributes
> Tests run: 17, Failures: 0, Errors: 0, Skipped: 0, Time elapsed: 512.333
> sec - in
> org.apache.hadoop.hbase.mapreduce.TestLoadIncrementalHFilesUseSecurityEndPoint
> Java HotSpot(TM) 64-Bit Server VM warning: ignoring option
> MaxPermSize=256m; support was removed in 8.0
> Java HotSpot(TM) 64-Bit Server VM warning: ignoring option
> MaxPermSize=256m; support was removed in 8.0
> Running org.apache.hadoop.hbase.mapreduce.TestWALRecordReader
> Tests run: 2, Failures: 0, Errors: 0, Skipped: 0, Time elapsed: 4.61 sec -
> in org.apache.hadoop.hbase.mapreduce.TestWALRecordReader
> Java HotSpot(TM) 64-Bit Server VM warning: ignoring option
> MaxPermSize=256m; support was removed in 8.0
> Tests run: 1, Failures: 0, Errors: 0, Skipped: 0, Time elapsed: 289.591
> sec - in org.apache.hadoop.hbase.mapreduce.TestHashTable
> Java HotSpot(TM) 64-Bit Server VM warning: ignoring option
> MaxPermSize=256m; support was removed in 8.0
> Running org.apache.hadoop.hbase.mapreduce.TestSyncTable
> Running
> org.apache.hadoop.hbase.mapreduce.TestSecureLoadIncrementalHFilesSplitRecovery
> Tests run: 5, Failures: 0, Errors: 0, Skipped: 0, Time elapsed: 68.246 sec
> - in
> org.apache.hadoop.hbase.mapreduce.TestSecureLoadIncrementalHFilesSplitRecovery
> Java HotSpot(TM) 64-Bit Server VM warning: ignoring option
> MaxPermSize=256m; support was removed in 8.0
> Running org.apache.hadoop.hbase.mapreduce.TestTimeRangeMapRed
> Java HotSpot(TM) 64-Bit Server VM warning: ignoring option
> MaxPermSize=256m; support was removed in 8.0
> Running org.apache.hadoop.hbase.mapreduce.TestTableSnapshotInputFormat
> Tests run: 4, Failures: 0, Errors: 0, Skipped: 0, Time elapsed: 702.727
> sec - in org.apache.hadoop.hbase.mapreduce.TestMultiTableInputFormat
> Java HotSpot(TM) 64-Bit Server VM warning: ignoring option
> MaxPermSize=256m; support was removed in 8.0
> Running org.apache.hadoop.hbase.mapreduce.TestImportTSVWithTTLs
> Tests run: 1, Failures: 0, Errors: 0, Skipped: 0, Time elapsed: 190.028
> sec - in org.apache.hadoop.hbase.mapreduce.TestTimeRangeMapRed
> Java HotSpot(TM) 64-Bit Server VM warning: ignoring option
> MaxPermSize=256m; support was removed in 8.0
> Tests run: 1, Failures: 0, Errors: 0, Skipped: 0, Time elapsed: 392.807
> sec - in org.apache.hadoop.hbase.mapreduce.TestSyncTable
> Java HotSpot(TM) 64-Bit Server VM warning: ignoring option
> MaxPermSize=256m; support was removed in 8.0
> Java HotSpot(TM) 64-Bit Server VM warning: ignoring option
> MaxPermSize=256m; support was removed in 8.0
> Running org.apache.hadoop.hbase.mapreduce.TestCellCounter
> Tests run: 1, Failures: 0, Errors: 0, Skipped: 0, Time elapsed: 145.888
> sec - in org.apache.hadoop.hbase.mapreduce.TestImportTSVWithTTLs
> Java HotSpot(TM) 64-Bit Server VM warning: ignoring option
> MaxPermSize=256m; support was removed in 8.0
> Running org.apache.hadoop.hbase.mapreduce.TestTableInputFormatScan1
> Running org.apache.hadoop.hbase.mapreduce.TestHRegionPartitioner
> Tests run: 1, Failures: 0, Errors: 0, Skipped: 0, Time elapsed: 23.519 sec
> - in org.apache.hadoop.hbase.mapreduce.TestHRegionPartitioner
> Java HotSpot(TM) 64-Bit Server VM warning: ignoring option
> MaxPermSize=256m; support was removed in 8.0
> Java HotSpot(TM) 64-Bit Server VM warning: ignoring option
> MaxPermSize=256m; support was removed in 8.0
> Running org.apache.hadoop.hbase.mapreduce.TestLoadIncrementalHFiles
> Tests run: 7, Failures: 0, Errors: 0, Skipped: 0, Time elapsed: 164.336
> sec - in org.apache.hadoop.hbase.mapreduce.TestTableInputFormatScan1
> Java HotSpot(TM) 64-Bit Server VM warning: ignoring option
> MaxPermSize=256m; support was removed in 8.0
> Running org.apache.hadoop.hbase.mapreduce.TestSecureLoadIncrementalHFiles
> Running org.apache.hadoop.hbase.mapreduce.TestTableInputFormat
> Tests run: 8, Failures: 0, Errors: 0, Skipped: 0, Time elapsed: 286.802
> sec - in org.apache.hadoop.hbase.mapreduce.TestTableInputFormat
> Java HotSpot(TM) 64-Bit Server VM warning: ignoring option
> MaxPermSize=256m; support was removed in 8.0
> Running org.apache.hadoop.hbase.mapreduce.TestTableInputFormatScan2
> Tests run: 7, Failures: 0, Errors: 0, Skipped: 0, Time elapsed: 623.515
> sec - in org.apache.hadoop.hbase.mapreduce.TestCellCounter
> Java HotSpot(TM) 64-Bit Server VM warning: ignoring option
> MaxPermSize=256m; support was removed in 8.0
> Java HotSpot(TM) 64-Bit Server VM warning: ignoring option
> MaxPermSize=256m; support was removed in 8.0
> Tests run: 17, Failures: 0, Errors: 0, Skipped: 0, Time elapsed: 489.705
> sec - in org.apache.hadoop.hbase.mapreduce.TestLoadIncrementalHFiles
> Java HotSpot(TM) 64-Bit Server VM warning: ignoring option
> MaxPermSize=256m; support was removed in 8.0
> Java HotSpot(TM) 64-Bit Server VM warning: ignoring option
> MaxPermSize=256m; support was removed in 8.0
> Running org.apache.hadoop.hbase.mapreduce.TestImportExport
> Tests run: 17, Failures: 0, Errors: 0, Skipped: 0, Time elapsed: 514.135
> sec - in org.apache.hadoop.hbase.mapreduce.TestSecureLoadIncrementalHFiles
> Java HotSpot(TM) 64-Bit Server VM warning: ignoring option
> MaxPermSize=256m; support was removed in 8.0
> Running org.apache.hadoop.hbase.mapreduce.TestRowCounter
> Running org.apache.hadoop.hbase.mapreduce.TestCopyTable
> Running
> org.apache.hadoop.hbase.mapreduce.TestLoadIncrementalHFilesSplitRecovery
> Tests run: 7, Failures: 0, Errors: 0, Skipped: 0, Time elapsed: 155.526
> sec - in org.apache.hadoop.hbase.mapreduce.TestTableInputFormatScan2
> Java HotSpot(TM) 64-Bit Server VM warning: ignoring option
> MaxPermSize=256m; support was removed in 8.0
> Running org.apache.hadoop.hbase.mapreduce.TestHFileOutputFormat2
> Tests run: 14, Failures: 0, Errors: 0, Skipped: 14, Time elapsed: 0.008
> sec - in org.apache.hadoop.hbase.mapreduce.TestHFileOutputFormat2
> Java HotSpot(TM) 64-Bit Server VM warning: ignoring option
> MaxPermSize=256m; support was removed in 8.0
> Java HotSpot(TM) 64-Bit Server VM warning: ignoring option
> MaxPermSize=256m; support was removed in 8.0
> Tests run: 5, Failures: 0, Errors: 0, Skipped: 0, Time elapsed: 91.26 sec
> - in
> org.apache.hadoop.hbase.mapreduce.TestLoadIncrementalHFilesSplitRecovery
> Java HotSpot(TM) 64-Bit Server VM warning: ignoring option
> MaxPermSize=256m; support was removed in 8.0
> Running org.apache.hadoop.hbase.mapreduce.TestMultithreadedTableMapper
> Running org.apache.hadoop.hbase.mapreduce.TestImportTSVWithVisibilityLabels
> Tests run: 7, Failures: 0, Errors: 0, Skipped: 0, Time elapsed: 263.25 sec
> - in org.apache.hadoop.hbase.mapreduce.TestImportTSVWithVisibilityLabels
> Java HotSpot(TM) 64-Bit Server VM warning: ignoring option
> MaxPermSize=256m; support was removed in 8.0
> Running org.apache.hadoop.hbase.mapreduce.TestImportTsv
> Tests run: 1, Failures: 0, Errors: 0, Skipped: 0, Time elapsed: 393.228
> sec - in org.apache.hadoop.hbase.mapreduce.TestMultithreadedTableMapper
> Java HotSpot(TM) 64-Bit Server VM warning: ignoring option
> MaxPermSize=256m; support was removed in 8.0
> Tests run: 5, Failures: 0, Errors: 0, Skipped: 0, Time elapsed: 598.969
> sec - in org.apache.hadoop.hbase.mapreduce.TestCopyTable
> Java HotSpot(TM) 64-Bit Server VM warning: ignoring option
> MaxPermSize=256m; support was removed in 8.0
> Running org.apache.hadoop.hbase.mapreduce.TestTableMapReduce
> Running org.apache.hadoop.hbase.mapreduce.TestMultiTableSnapshotInputFormat
> Java HotSpot(TM) 64-Bit Server VM warning: ignoring option
> MaxPermSize=256m; support was removed in 8.0
> Tests run: 2, Failures: 0, Errors: 0, Skipped: 0, Time elapsed: 617.291
> sec - in org.apache.hadoop.hbase.mapreduce.TestTableMapReduce
>
> Results :
>
> Flaked tests:
>
> org.apache.hadoop.hbase.client.TestAdmin1.testMergeRegions(org.apache.hadoop.hbase.client.TestAdmin1)
>   Run 1: TestAdmin1.testMergeRegions:1443 expected:<1> but was:<2>
>   Run 2: TestAdmin1.testMergeRegions:1443 expected:<1> but was:<2>
>   Run 3: PASS
>
>
> Tests run: 2317, Failures: 0, Errors: 0, Skipped: 37, Flakes: 1
>
> [INFO]
> ------------------------------------------------------------------------
> [INFO] Reactor Summary:
> [INFO]
> [INFO] Apache HBase ...................................... SUCCESS
> [1:08.152s]
> [INFO] Apache HBase - Checkstyle ......................... SUCCESS [5.885s]
> [INFO] Apache HBase - Resource Bundle .................... SUCCESS [0.421s]
> [INFO] Apache HBase - Annotations ........................ SUCCESS [3.441s]
> [INFO] Apache HBase - Protocol ........................... SUCCESS
> [37.128s]
> [INFO] Apache HBase - Common ............................. SUCCESS
> [3:51.210s]
> [INFO] Apache HBase - Procedure .......................... SUCCESS
> [4:27.857s]
> [INFO] Apache HBase - Client ............................. SUCCESS
> [2:20.453s]
> [INFO] Apache HBase - Hadoop Compatibility ............... SUCCESS
> [13.797s]
> [INFO] Apache HBase - Hadoop Two Compatibility ........... SUCCESS
> [22.650s]
> [INFO] Apache HBase - Prefix Tree ........................ SUCCESS
> [24.888s]
> [INFO] Apache HBase - Server ............................. FAILURE
> [4:02:07.499s]
> [INFO] Apache HBase - Testing Util ....................... SKIPPED
> [INFO] Apache HBase - Thrift ............................. SKIPPED
> [INFO] Apache HBase - Rest ............................... SKIPPED
> [INFO] Apache HBase - Shell .............................. SKIPPED
> [INFO] Apache HBase - Integration Tests .................. SKIPPED
> [INFO] Apache HBase - Examples ........................... SKIPPED
> [INFO] Apache HBase - External Block Cache ............... SKIPPED
> [INFO] Apache HBase - Assembly ........................... SKIPPED
> [INFO] Apache HBase - Shaded ............................. SKIPPED
> [INFO] Apache HBase - Shaded - Client .................... SKIPPED
> [INFO] Apache HBase - Shaded - Server .................... SKIPPED
> [INFO]
> ------------------------------------------------------------------------
> [INFO] BUILD FAILURE
> [INFO]
> ------------------------------------------------------------------------
> [INFO] Total time: 4:16:07.656s
> [INFO] Finished at: Thu Dec 17 22:05:40 UTC 2015
> [INFO] Final Memory: 429M/2579M
> [INFO]
> ------------------------------------------------------------------------
> [ERROR] Failed to execute goal
> org.apache.maven.plugins:maven-surefire-plugin:2.18.1:test
> (secondPartTestsExecution) on project hbase-server: There was a timeout or
> other error in the fork -> [Help 1]
> [ERROR]
> [ERROR] To see the full stack trace of the errors, re-run Maven with the
> -e switch.
> [ERROR] Re-run Maven using the -X switch to enable full debug logging.
> [ERROR]
> [ERROR] For more information about the errors and possible solutions,
> please read the following articles:
> [ERROR] [Help 1]
> http://cwiki.apache.org/confluence/display/MAVEN/MojoFailureException
> [ERROR]
> [ERROR] After correcting the problems, you can resume the build with the
> command
> [ERROR]   mvn <goals> -rf :hbase-server
> Build step 'Invoke top-level Maven targets' marked build as failure
> Performing Post build task...
> Match found for :.* : True
> Logical operation result is TRUE
> Running script  : # Post-build task script. TODO: Check this in and have
> all builds reference check-in.
> pwd && ls
> # NOTE!!!! The below code has been copied and pasted from
> ./dev-tools/run-test.sh
> # Do not change here without syncing there and vice-versa.
> ZOMBIE_TESTS_COUNT=`jps -v | grep surefirebooter | grep -e '-Dhbase.test'
> | wc -l`
> if [[ $ZOMBIE_TESTS_COUNT != 0 ]] ; then
>  echo "Suspicious java process found - waiting 30s to see if there are
> just slow to stop"
>  sleep 30
>  ZOMBIE_TESTS_COUNT=`jps -v | grep surefirebooter | grep -e '-Dhbase.test'
> | wc -l`
>  if [[ $ZOMBIE_TESTS_COUNT != 0 ]] ; then
>    echo " {color:red}There appear to be $ZOMBIE_TESTS_COUNT zombie
> tests{color}, they should have been killed by surefire but survived"
>    jps -v | grep surefirebooter | grep -e '-Dhbase.test'
>    jps -v | grep surefirebooter | grep -e '-Dhbase.test' | cut -d ' ' -f 1
> | xargs -n 1 jstack
>    # Exit with error
>    exit 1
>  else
>    echo "We're ok: there is no zombie test, but some tests took some time
> to stop"
>  fi
> else
>   echo "We're ok: there is no zombie test"
> fi
> [Hadoop] $ /bin/bash -xe /tmp/hudson7220437126041770342.sh
> + pwd
> <https://builds.apache.org/job/HBase-1.3/jdk=latest1.8,label=Hadoop/ws/>
> + ls
> bin
> CHANGES.txt
> conf
> dev-support
> hbase-annotations
> hbase-assembly
> hbase-checkstyle
> hbase-client
> hbase-common
> hbase-examples
> hbase-external-blockcache
> hbase-hadoop2-compat
> hbase-hadoop-compat
> hbase-it
> hbase-native-client
> hbase-prefix-tree
> hbase-procedure
> hbase-protocol
> hbase-resource-bundle
> hbase-rest
> hbase-server
> hbase-shaded
> hbase-shell
> hbase-testing-util
> hbase-thrift
> LICENSE.txt
> NOTICE.txt
> pom.xml
> README.txt
> src
> target
> ++ wc -l
> ++ grep -e -Dhbase.test
> ++ grep surefirebooter
> ++ jps -v
> + ZOMBIE_TESTS_COUNT=2
> + [[ 2 != 0 ]]
> + echo 'Suspicious java process found - waiting 30s to see if there are
> just slow to stop'
> Suspicious java process found - waiting 30s to see if there are just slow
> to stop
> + sleep 30
> ++ wc -l
> ++ grep -e -Dhbase.test
> ++ grep surefirebooter
> ++ jps -v
> + ZOMBIE_TESTS_COUNT=0
> + [[ 0 != 0 ]]
> + echo 'We'\''re ok: there is no zombie test, but some tests took some
> time to stop'
> We're ok: there is no zombie test, but some tests took some time to stop
> POST BUILD TASK : SUCCESS
> END OF POST BUILD TASK : 0
> Archiving artifacts
> Recording test results
>

Mime
  • Unnamed multipart/alternative (inline, None, 0 bytes)
View raw message