hbase-dev mailing list archives

Site index · List index
Message view « Date » · « Thread »
Top « Date » · « Thread »
From Stack <st...@duboce.net>
Subject Re: Build failed in Jenkins: HBase-1.2 » latest1.8,Hadoop #399
Date Wed, 25 Nov 2015 07:57:42 GMT
This is HBASE-14734

On Tue, Nov 24, 2015 at 6:15 PM, Apache Jenkins Server <
jenkins@builds.apache.org> wrote:

> See <
> https://builds.apache.org/job/HBase-1.2/jdk=latest1.8,label=Hadoop/399/changes
> >
>
> Changes:
>
> [Gary Helmling] HBASE-14821 Allow configuration overrides in
> TableOutputFormat
>
> [tedyu] HBASE-14875 Forward port HBASE-14207 'Region was hijacked and
> remained
>
> ------------------------------------------
> [...truncated 45841 lines...]
> Java HotSpot(TM) 64-Bit Server VM warning: ignoring option
> MaxPermSize=256m; support was removed in 8.0
> Java HotSpot(TM) 64-Bit Server VM warning: ignoring option
> MaxPermSize=256m; support was removed in 8.0
> Running org.apache.hadoop.hbase.filter.TestMultiRowRangeFilter
> Java HotSpot(TM) 64-Bit Server VM warning: ignoring option
> MaxPermSize=256m; support was removed in 8.0
> Java HotSpot(TM) 64-Bit Server VM warning: ignoring option
> MaxPermSize=256m; support was removed in 8.0
> Running org.apache.hadoop.hbase.filter.TestFilterWithScanLimits
> Java HotSpot(TM) 64-Bit Server VM warning: ignoring option
> MaxPermSize=256m; support was removed in 8.0
> Java HotSpot(TM) 64-Bit Server VM warning: ignoring option
> MaxPermSize=256m; support was removed in 8.0
> Tests run: 1, Failures: 0, Errors: 0, Skipped: 0, Time elapsed: 4.365 sec
> - in org.apache.hadoop.hbase.filter.TestFilterWithScanLimits
> Java HotSpot(TM) 64-Bit Server VM warning: ignoring option
> MaxPermSize=256m; support was removed in 8.0
> Java HotSpot(TM) 64-Bit Server VM warning: ignoring option
> MaxPermSize=256m; support was removed in 8.0
> Java HotSpot(TM) 64-Bit Server VM warning: ignoring option
> MaxPermSize=256m; support was removed in 8.0
> Running org.apache.hadoop.hbase.filter.TestScanRowPrefix
> Running org.apache.hadoop.hbase.TestGlobalMemStoreSize
> Tests run: 1, Failures: 0, Errors: 0, Skipped: 0, Time elapsed: 6.65 sec -
> in org.apache.hadoop.hbase.filter.TestScanRowPrefix
> Java HotSpot(TM) 64-Bit Server VM warning: ignoring option
> MaxPermSize=256m; support was removed in 8.0
> Running org.apache.hadoop.hbase.TestHBaseOnOtherDfsCluster
> Running org.apache.hadoop.hbase.filter.TestFilterWrapper
> Tests run: 1, Failures: 0, Errors: 0, Skipped: 0, Time elapsed: 4.066 sec
> - in org.apache.hadoop.hbase.filter.TestFilterWrapper
> Java HotSpot(TM) 64-Bit Server VM warning: ignoring option
> MaxPermSize=256m; support was removed in 8.0
> Tests run: 1, Failures: 0, Errors: 0, Skipped: 0, Time elapsed: 14.376 sec
> - in org.apache.hadoop.hbase.TestGlobalMemStoreSize
> Java HotSpot(TM) 64-Bit Server VM warning: ignoring option
> MaxPermSize=256m; support was removed in 8.0
> Tests run: 20, Failures: 0, Errors: 0, Skipped: 0, Time elapsed: 22.007
> sec - in org.apache.hadoop.hbase.filter.TestMultiRowRangeFilter
> Java HotSpot(TM) 64-Bit Server VM warning: ignoring option
> MaxPermSize=256m; support was removed in 8.0
> Java HotSpot(TM) 64-Bit Server VM warning: ignoring option
> MaxPermSize=256m; support was removed in 8.0
> Tests run: 1, Failures: 0, Errors: 0, Skipped: 0, Time elapsed: 11.337 sec
> - in org.apache.hadoop.hbase.TestHBaseOnOtherDfsCluster
> Java HotSpot(TM) 64-Bit Server VM warning: ignoring option
> MaxPermSize=256m; support was removed in 8.0
> Java HotSpot(TM) 64-Bit Server VM warning: ignoring option
> MaxPermSize=256m; support was removed in 8.0
> Java HotSpot(TM) 64-Bit Server VM warning: ignoring option
> MaxPermSize=256m; support was removed in 8.0
> Java HotSpot(TM) 64-Bit Server VM warning: ignoring option
> MaxPermSize=256m; support was removed in 8.0
> Java HotSpot(TM) 64-Bit Server VM warning: ignoring option
> MaxPermSize=256m; support was removed in 8.0
> Java HotSpot(TM) 64-Bit Server VM warning: ignoring option
> MaxPermSize=256m; support was removed in 8.0
> Running org.apache.hadoop.hbase.TestNamespace
> Running org.apache.hadoop.hbase.migration.TestUpgradeTo96
> Running org.apache.hadoop.hbase.replication.TestReplicationSource
> Tests run: 1, Failures: 0, Errors: 0, Skipped: 0, Time elapsed: 0.243 sec
> - in org.apache.hadoop.hbase.replication.TestReplicationSource
> Java HotSpot(TM) 64-Bit Server VM warning: ignoring option
> MaxPermSize=256m; support was removed in 8.0
> Tests run: 5, Failures: 0, Errors: 0, Skipped: 0, Time elapsed: 2.981 sec
> - in org.apache.hadoop.hbase.migration.TestUpgradeTo96
> Java HotSpot(TM) 64-Bit Server VM warning: ignoring option
> MaxPermSize=256m; support was removed in 8.0
> Running org.apache.hadoop.hbase.migration.TestNamespaceUpgrade
> Running org.apache.hadoop.hbase.replication.TestReplicationWithTags
> Running org.apache.hadoop.hbase.replication.TestPerTableCFReplication
> Tests run: 1, Failures: 0, Errors: 0, Skipped: 0, Time elapsed: 3.679 sec
> - in org.apache.hadoop.hbase.replication.TestReplicationWithTags
> Java HotSpot(TM) 64-Bit Server VM warning: ignoring option
> MaxPermSize=256m; support was removed in 8.0
> Tests run: 9, Failures: 0, Errors: 0, Skipped: 1, Time elapsed: 25.689 sec
> - in org.apache.hadoop.hbase.TestNamespace
> Java HotSpot(TM) 64-Bit Server VM warning: ignoring option
> MaxPermSize=256m; support was removed in 8.0
> Tests run: 5, Failures: 0, Errors: 0, Skipped: 0, Time elapsed: 19.8 sec -
> in org.apache.hadoop.hbase.migration.TestNamespaceUpgrade
> Java HotSpot(TM) 64-Bit Server VM warning: ignoring option
> MaxPermSize=256m; support was removed in 8.0
> Running org.apache.hadoop.hbase.replication.TestMultiSlaveReplication
> Running org.apache.hadoop.hbase.replication.TestReplicationSmallTests
> Running
> org.apache.hadoop.hbase.replication.TestReplicationChangingPeerRegionservers
> Tests run: 1, Failures: 0, Errors: 0, Skipped: 0, Time elapsed: 5.024 sec
> - in
> org.apache.hadoop.hbase.replication.TestReplicationChangingPeerRegionservers
> Java HotSpot(TM) 64-Bit Server VM warning: ignoring option
> MaxPermSize=256m; support was removed in 8.0
> Tests run: 2, Failures: 0, Errors: 0, Skipped: 0, Time elapsed: 35.34 sec
> - in org.apache.hadoop.hbase.replication.TestPerTableCFReplication
> Java HotSpot(TM) 64-Bit Server VM warning: ignoring option
> MaxPermSize=256m; support was removed in 8.0
> Running org.apache.hadoop.hbase.replication.TestMasterReplication
> Tests run: 1, Failures: 0, Errors: 0, Skipped: 0, Time elapsed: 34.755 sec
> - in org.apache.hadoop.hbase.replication.TestMultiSlaveReplication
> Java HotSpot(TM) 64-Bit Server VM warning: ignoring option
> MaxPermSize=256m; support was removed in 8.0
> Running org.apache.hadoop.hbase.replication.TestReplicationKillSlaveRS
> Running
> org.apache.hadoop.hbase.replication.regionserver.TestReplicationWALReaderManager
> Tests run: 1, Failures: 0, Errors: 0, Skipped: 0, Time elapsed: 14.014 sec
> - in org.apache.hadoop.hbase.replication.TestReplicationKillSlaveRS
> Java HotSpot(TM) 64-Bit Server VM warning: ignoring option
> MaxPermSize=256m; support was removed in 8.0
> Java HotSpot(TM) 64-Bit Server VM warning: ignoring option
> MaxPermSize=256m; support was removed in 8.0
> Running
> org.apache.hadoop.hbase.replication.regionserver.TestRegionReplicaReplicationEndpointNoMaster
> Tests run: 10, Failures: 0, Errors: 0, Skipped: 0, Time elapsed: 53.709
> sec - in org.apache.hadoop.hbase.replication.TestReplicationSmallTests
> Java HotSpot(TM) 64-Bit Server VM warning: ignoring option
> MaxPermSize=256m; support was removed in 8.0
> Running
> org.apache.hadoop.hbase.replication.regionserver.TestReplicationSourceManager
> Tests run: 5, Failures: 0, Errors: 0, Skipped: 0, Time elapsed: 4.169 sec
> - in
> org.apache.hadoop.hbase.replication.regionserver.TestReplicationSourceManager
> Java HotSpot(TM) 64-Bit Server VM warning: ignoring option
> MaxPermSize=256m; support was removed in 8.0
> Running
> org.apache.hadoop.hbase.replication.regionserver.TestReplicationSink
> Tests run: 5, Failures: 0, Errors: 0, Skipped: 0, Time elapsed: 1.8 sec -
> in org.apache.hadoop.hbase.replication.regionserver.TestReplicationSink
> Java HotSpot(TM) 64-Bit Server VM warning: ignoring option
> MaxPermSize=256m; support was removed in 8.0
> Java HotSpot(TM) 64-Bit Server VM warning: ignoring option
> MaxPermSize=256m; support was removed in 8.0
> Tests run: 4, Failures: 0, Errors: 0, Skipped: 0, Time elapsed: 31.685 sec
> - in
> org.apache.hadoop.hbase.replication.regionserver.TestRegionReplicaReplicationEndpointNoMaster
> Java HotSpot(TM) 64-Bit Server VM warning: ignoring option
> MaxPermSize=256m; support was removed in 8.0
> Running
> org.apache.hadoop.hbase.replication.regionserver.TestRegionReplicaReplicationEndpoint
> Tests run: 4, Failures: 0, Errors: 0, Skipped: 0, Time elapsed: 79.074 sec
> - in org.apache.hadoop.hbase.replication.TestMasterReplication
> Java HotSpot(TM) 64-Bit Server VM warning: ignoring option
> MaxPermSize=256m; support was removed in 8.0
> Running
> org.apache.hadoop.hbase.replication.multiwal.TestReplicationKillMasterRSCompressedWithMultipleWAL
> Running
> org.apache.hadoop.hbase.replication.multiwal.TestReplicationEndpointWithMultipleWAL
> Tests run: 3, Failures: 0, Errors: 0, Skipped: 0, Time elapsed: 199.551
> sec - in org.apache.hadoop.hbase.filter.TestFuzzyRowFilterEndToEnd
> Java HotSpot(TM) 64-Bit Server VM warning: ignoring option
> MaxPermSize=256m; support was removed in 8.0
> Tests run: 4, Failures: 0, Errors: 0, Skipped: 0, Time elapsed: 11.19 sec
> - in
> org.apache.hadoop.hbase.replication.multiwal.TestReplicationEndpointWithMultipleWAL
> Java HotSpot(TM) 64-Bit Server VM warning: ignoring option
> MaxPermSize=256m; support was removed in 8.0
> Tests run: 1, Failures: 0, Errors: 0, Skipped: 0, Time elapsed: 21.903 sec
> - in
> org.apache.hadoop.hbase.replication.multiwal.TestReplicationKillMasterRSCompressedWithMultipleWAL
> Java HotSpot(TM) 64-Bit Server VM warning: ignoring option
> MaxPermSize=256m; support was removed in 8.0
> Running org.apache.hadoop.hbase.replication.TestReplicationStateZKImpl
> Tests run: 6, Failures: 0, Errors: 0, Skipped: 0, Time elapsed: 0.852 sec
> - in org.apache.hadoop.hbase.replication.TestReplicationStateZKImpl
> Java HotSpot(TM) 64-Bit Server VM warning: ignoring option
> MaxPermSize=256m; support was removed in 8.0
> Java HotSpot(TM) 64-Bit Server VM warning: ignoring option
> MaxPermSize=256m; support was removed in 8.0
> Running
> org.apache.hadoop.hbase.replication.multiwal.TestReplicationSyncUpToolWithMultipleWAL
> Running org.apache.hadoop.hbase.replication.TestReplicationEndpoint
> Running org.apache.hadoop.hbase.replication.TestReplicationSyncUpTool
> Tests run: 4, Failures: 0, Errors: 0, Skipped: 0, Time elapsed: 9.195 sec
> - in org.apache.hadoop.hbase.replication.TestReplicationEndpoint
> Java HotSpot(TM) 64-Bit Server VM warning: ignoring option
> MaxPermSize=256m; support was removed in 8.0
> Running org.apache.hadoop.hbase.replication.TestReplicationTrackerZKImpl
> Tests run: 5, Failures: 0, Errors: 0, Skipped: 0, Time elapsed: 0.959 sec
> - in org.apache.hadoop.hbase.replication.TestReplicationTrackerZKImpl
> Java HotSpot(TM) 64-Bit Server VM warning: ignoring option
> MaxPermSize=256m; support was removed in 8.0
> Tests run: 9, Failures: 0, Errors: 0, Skipped: 0, Time elapsed: 89.955 sec
> - in
> org.apache.hadoop.hbase.replication.regionserver.TestRegionReplicaReplicationEndpoint
> Java HotSpot(TM) 64-Bit Server VM warning: ignoring option
> MaxPermSize=256m; support was removed in 8.0
> Running org.apache.hadoop.hbase.replication.TestReplicationKillMasterRS
> Running
> org.apache.hadoop.hbase.replication.TestReplicationKillMasterRSCompressed
> Tests run: 1, Failures: 0, Errors: 0, Skipped: 0, Time elapsed: 53.719 sec
> - in
> org.apache.hadoop.hbase.replication.multiwal.TestReplicationSyncUpToolWithMultipleWAL
> Java HotSpot(TM) 64-Bit Server VM warning: ignoring option
> MaxPermSize=256m; support was removed in 8.0
> Tests run: 1, Failures: 0, Errors: 0, Skipped: 0, Time elapsed: 15.209 sec
> - in org.apache.hadoop.hbase.replication.TestReplicationKillMasterRS
> Tests run: 1, Failures: 0, Errors: 0, Skipped: 0, Time elapsed: 51.938 sec
> - in org.apache.hadoop.hbase.replication.TestReplicationSyncUpTool
> Tests run: 1, Failures: 0, Errors: 0, Skipped: 0, Time elapsed: 15.465 sec
> - in
> org.apache.hadoop.hbase.replication.TestReplicationKillMasterRSCompressed
> Running
> org.apache.hadoop.hbase.replication.TestReplicationDisableInactivePeer
> Tests run: 8, Failures: 0, Errors: 0, Skipped: 0, Time elapsed: 200.524
> sec - in
> org.apache.hadoop.hbase.replication.regionserver.TestReplicationWALReaderManager
> Tests run: 1, Failures: 0, Errors: 0, Skipped: 0, Time elapsed: 20.689 sec
> - in org.apache.hadoop.hbase.replication.TestReplicationDisableInactivePeer
>
> Results :
>
> Tests in error:
>
> org.apache.hadoop.hbase.security.token.TestGenerateDelegationToken.org.apache.hadoop.hbase.security.token.TestGenerateDelegationToken
>   Run 1:
> TestGenerateDelegationToken.org.apache.hadoop.hbase.security.token.TestGenerateDelegationToken
> » Bind
>   Run 2: TestGenerateDelegationToken.tearDown:137 NullPointer
>
> Flaked tests:
>
> org.apache.hadoop.hbase.master.TestTableLockManager.testReapAllTableLocks(org.apache.hadoop.hbase.master.TestTableLockManager)
>   Run 1: TestTableLockManager.testReapAllTableLocks:283 » LockTimeout
> Timed out acquiri...
>   Run 2: PASS
>
>
> Tests run: 2343, Failures: 0, Errors: 1, Skipped: 40, Flakes: 1
>
> [INFO]
> ------------------------------------------------------------------------
> [INFO] Reactor Summary:
> [INFO]
> [INFO] Apache HBase ...................................... SUCCESS
> [1:40.893s]
> [INFO] Apache HBase - Checkstyle ......................... SUCCESS [9.595s]
> [INFO] Apache HBase - Resource Bundle .................... SUCCESS [0.179s]
> [INFO] Apache HBase - Annotations ........................ SUCCESS [1.212s]
> [INFO] Apache HBase - Protocol ........................... SUCCESS
> [18.899s]
> [INFO] Apache HBase - Common ............................. SUCCESS
> [2:52.434s]
> [INFO] Apache HBase - Procedure .......................... SUCCESS
> [3:22.455s]
> [INFO] Apache HBase - Client ............................. SUCCESS
> [1:25.310s]
> [INFO] Apache HBase - Hadoop Compatibility ............... SUCCESS [8.465s]
> [INFO] Apache HBase - Hadoop Two Compatibility ........... SUCCESS [7.897s]
> [INFO] Apache HBase - Prefix Tree ........................ SUCCESS [7.756s]
> [INFO] Apache HBase - Server ............................. FAILURE
> [1:21:52.991s]
> [INFO] Apache HBase - Testing Util ....................... SKIPPED
> [INFO] Apache HBase - Thrift ............................. SKIPPED
> [INFO] Apache HBase - Rest ............................... SKIPPED
> [INFO] Apache HBase - Shell .............................. SKIPPED
> [INFO] Apache HBase - Integration Tests .................. SKIPPED
> [INFO] Apache HBase - Examples ........................... SKIPPED
> [INFO] Apache HBase - External Block Cache ............... SKIPPED
> [INFO] Apache HBase - Assembly ........................... SKIPPED
> [INFO] Apache HBase - Shaded ............................. SKIPPED
> [INFO] Apache HBase - Shaded - Client .................... SKIPPED
> [INFO] Apache HBase - Shaded - Server .................... SKIPPED
> [INFO]
> ------------------------------------------------------------------------
> [INFO] BUILD FAILURE
> [INFO]
> ------------------------------------------------------------------------
> [INFO] Total time: 1:32:31.389s
> [INFO] Finished at: Wed Nov 25 02:11:47 UTC 2015
> [INFO] Final Memory: 94M/621M
> [INFO]
> ------------------------------------------------------------------------
> [ERROR] Failed to execute goal
> org.apache.maven.plugins:maven-surefire-plugin:2.18.1:test
> (secondPartTestsExecution) on project hbase-server: ExecutionException:
> java.lang.RuntimeException: There was an error in the forked process
> [ERROR] java.lang.ArrayIndexOutOfBoundsException: 1
> [ERROR] at
> org.apache.maven.surefire.common.junit4.JUnit4ProviderUtil.generateFailingTests(JUnit4ProviderUtil.java:64)
> [ERROR] at
> org.apache.maven.surefire.junitcore.JUnitCoreProvider.invoke(JUnitCoreProvider.java:151)
> [ERROR] at
> org.apache.maven.surefire.booter.ForkedBooter.invokeProviderInSameClassLoader(ForkedBooter.java:203)
> [ERROR] at
> org.apache.maven.surefire.booter.ForkedBooter.runSuitesInProcess(ForkedBooter.java:155)
> [ERROR] at
> org.apache.maven.surefire.booter.ForkedBooter.main(ForkedBooter.java:103)
> [ERROR] -> [Help 1]
> [ERROR]
> [ERROR] To see the full stack trace of the errors, re-run Maven with the
> -e switch.
> [ERROR] Re-run Maven using the -X switch to enable full debug logging.
> [ERROR]
> [ERROR] For more information about the errors and possible solutions,
> please read the following articles:
> [ERROR] [Help 1]
> http://cwiki.apache.org/confluence/display/MAVEN/MojoFailureException
> [ERROR]
> [ERROR] After correcting the problems, you can resume the build with the
> command
> [ERROR]   mvn <goals> -rf :hbase-server
> Build step 'Invoke top-level Maven targets' marked build as failure
> Performing Post build task...
> Match found for :.* : True
> Logical operation result is TRUE
> Running script  : # Post-build task script. TODO: Check this in and have
> all builds reference check-in.
> pwd && ls
> # NOTE!!!! The below code has been copied and pasted from
> ./dev-tools/run-test.sh
> # Do not change here without syncing there and vice-versa.
> ZOMBIE_TESTS_COUNT=`jps -v | grep surefirebooter | grep -e '-Dhbase.test'
> | wc -l`
> if [[ $ZOMBIE_TESTS_COUNT != 0 ]] ; then
>  echo "Suspicious java process found - waiting 30s to see if there are
> just slow to stop"
>  sleep 30
>  ZOMBIE_TESTS_COUNT=`jps -v | grep surefirebooter | grep -e '-Dhbase.test'
> | wc -l`
>  if [[ $ZOMBIE_TESTS_COUNT != 0 ]] ; then
>    echo " {color:red}There appear to be $ZOMBIE_TESTS_COUNT zombie
> tests{color}, they should have been killed by surefire but survived"
>    jps -v | grep surefirebooter | grep -e '-Dhbase.test'
>    jps -v | grep surefirebooter | grep -e '-Dhbase.test' | cut -d ' ' -f 1
> | xargs -n 1 jstack
>    # Exit with error
>    exit 1
>  else
>    echo "We're ok: there is no zombie test, but some tests took some time
> to stop"
>  fi
> else
>   echo "We're ok: there is no zombie test"
> fi
> [Hadoop] $ /bin/bash -xe /tmp/hudson2470723809168200466.sh
> + pwd
> <https://builds.apache.org/job/HBase-1.2/jdk=latest1.8,label=Hadoop/ws/>
> + ls
> bin
> CHANGES.txt
> conf
> dev-support
> hbase-annotations
> hbase-assembly
> hbase-checkstyle
> hbase-client
> hbase-common
> hbase-examples
> hbase-external-blockcache
> hbase-hadoop2-compat
> hbase-hadoop-compat
> hbase-it
> hbase-native-client
> hbase-prefix-tree
> hbase-procedure
> hbase-protocol
> hbase-resource-bundle
> hbase-rest
> hbase-server
> hbase-shaded
> hbase-shell
> hbase-spark
> hbase-testing-util
> hbase-thrift
> LICENSE.txt
> NOTICE.txt
> pom.xml
> README.txt
> src
> target
> ++ jps -v
> ++ grep surefirebooter
> ++ wc -l
> ++ grep -e -Dhbase.test
> + ZOMBIE_TESTS_COUNT=0
> + [[ 0 != 0 ]]
> + echo 'We'\''re ok: there is no zombie test'
> We're ok: there is no zombie test
> POST BUILD TASK : SUCCESS
> END OF POST BUILD TASK : 0
> Archiving artifacts
> Recording test results
>

Mime
  • Unnamed multipart/alternative (inline, None, 0 bytes)
View raw message